{"text_format":"3","workbook":"xlsx","n_sheets":9,"sheets":["Summary","Template","Ingredients_DB","UOM_Conversions","HowTo","Example 1","Example 2","Example 3","_NAV_STATE"],"not_rendered":{"macros":1,"defined_names":5},"read":"whole","date_system":"1900"}

{"sheet":"Summary","index":0,"n_rows":6,"n_cols":9,"rows_kept":6}
[null,"MENU RECIPE COST SUMMARY"]
[null,"Hospitality Finance Network"]
[null,"SheetName","Menu Item","Category","Yield (portions)","Sell Price","Cost/Portion","Food Cost %","Last Updated"]
[null,"Example 1","Example 1","Starter",1,{"v":16,"d":"16.00"},{"v":3.820921052631579,"d":"3.82"},{"v":0.23880756578947368,"d":"24%"},"2026-02-02"]
[null,"Example 2","Example 2","Starter",1,{"v":16,"d":"16.00"},{"v":3.820921052631579,"d":"3.82"},{"v":0.23880756578947368,"d":"24%"},"2026-02-02"]
[null,"Example 3","Example 3","Starter",1,{"v":16,"d":"16.00"},{"v":3.820921052631579,"d":"3.82"},{"v":0.23880756578947368,"d":"24%"},"2026-02-06"]

{"sheet":"Template","index":1,"n_rows":50,"n_cols":31,"rows_kept":50,"merged":[[1,12,14,12],[19,10,49,12]]}
["RECIPE COST CARD",{"$nulls":9},"ALLERGEN SUMMARY (from ingredient flags)",{"$nulls":3},"For calculation (do not delete)"]
["Restaurant / Concept",null,"Demo Restaurant",null,"Last Updated","2026-01-31",{"$nulls":4},"Milk",{"$f":"IF(MAX(R21:R50)>0,\"YES\",\"\")","v":"YES"},"(e.g., gluten-free option? vegan? substitution guidance, allergen handling, etc.)"]
["Menu Item Name",null,"Classic Cheeseburger",{"$nulls":3},"Currency 1","Currency 2","Notes",null,"Egg",{"$f":"IF(MAX(S21:S50)>0,\"YES\",\"\")","v":"YES"}]
["Category",null,"Starter",null,"Total Batch Food Cost",null,{"$f":"IFERROR(SUM(H21:H50),0)","v":{"v":3.820921052631579,"d":"$3.82"}},null,"SUM(G21:G50)",null,"Fish",{"$f":"IF(MAX(T21:T50)>0,\"YES\",\"\")","v":""}]
["Station",null,"Grill",null,"Other Costs (packaging etc.)",{"$nulls":3},"IFERROR(SUM($G$14:$G$17),0)",null,"Shellfish",{"$f":"IF(MAX(U21:U50)>0,\"YES\",\"\")","v":""}]
["Batch Yield (portions)",null,1,null,"Total Batch Cost",null,{"$f":"G4+G5","v":{"v":3.820921052631579,"d":"$3.82"}},{"$nulls":3},"Molluscs",{"$f":"IF(MAX(V21:V50)>0,\"YES\",\"\")","v":""}]
["Portion Size",null,"1 burger + fries",null,"Cost / Portion",null,{"$f":"IFERROR(G6/$C$6,0)","v":{"v":3.820921052631579,"d":"$3.82"}},{"$nulls":3},"Peanuts",{"$f":"IF(MAX(W21:W50)>0,\"YES\",\"\")","v":""}]
["Selling Price / Portion",null,{"v":16,"d":"$16.00"},null,"Food Cost %",null,{"$f":"IFERROR(G7/$C$8,0)","v":{"v":0.23880756578947368,"d":"23.9%"}},{"$nulls":3},"Tree Nuts",{"$f":"IF(MAX(X21:X50)>0,\"YES\",\"\")","v":""}]
["Target Food Cost %",null,{"v":0.3,"d":"30.0%"},null,"Gross Profit / Portion",null,{"$f":"IFERROR($C$8-G7,0)","v":{"v":12.17907894736842,"d":"$12.18"}},{"$nulls":3},"Wheat/Gluten",{"$f":"IF(MAX(Y21:Y50)>0,\"YES\",\"\")","v":"YES"}]
["Prep Time (min)",null,10,null,"Gross Margin %",null,{"$f":"IFERROR(1-G8,0)","v":{"v":0.7611924342105263,"d":"76.1%"}},{"$nulls":3},"Soy",{"$f":"IF(MAX(Z21:Z50)>0,\"YES\",\"\")","v":"YES"}]
["Cook Time (min)",null,8,{"$nulls":7},"Sesame",{"$f":"IF(MAX(AA21:AA50)>0,\"YES\",\"\")","v":"YES"}]
["Shelf Life / Storage",null,"Hold cold 2 days; cook to order",null,"OTHER COSTS (not part of cost of sale in hotels and resorts)",{"$nulls":5},"Mustard",{"$f":"IF(MAX(AB21:AB50)>0,\"YES\",\"\")","v":""}]
[{"$nulls":4},"Description",null,"Cost",null,"Notes",null,"Celery",{"$f":"IF(MAX(AC21:AC50)>0,\"YES\",\"\")","v":""}]
[{"$nulls":4},"Packaging",null,{"v":0.25,"d":"$0.25"},{"$nulls":3},"Lupin",{"$f":"IF(MAX(AD21:AD50)>0,\"YES\",\"\")","v":""}]
[{"$nulls":4},"Napkin/condiment cup",null,{"v":0.1,"d":"$0.10"},{"$nulls":3},"Sulphites",{"$f":"IF(MAX(AE21:AE50)>0,\"YES\",\"\")","v":""}]
[{"$nulls":6},{"v":0,"d":"$0.00"}]
[{"$nulls":6},{"v":0,"d":"$0.00"}]
[]
["INGREDIENTS (enter Qty + Unit; costs auto-calc)",{"$nulls":4},"Actual Qty","Unit Cost",{"$nulls":3},"PREPARATION METHOD"]
["Line","Ingredient","Qty","Unit","Yield %","in base units","(per base)","Line Cost","Notes",null,"Step-by-step method - \n\ncritical control points - \n\nholding temps - \n\nplating - \n\ncross-contamination notes - "]
{"$rows_left_out":31}
{"sheet":"Ingredients_DB","index":2,"n_rows":501,"n_cols":26,"rows_kept":501}
["ID","Ingredient","Category","Supplier","PackCost","PackSize","PackUOM","BaseType","BaseUnit","PackBaseQty","UnitCostPerBase","Notes","Milk","Egg","Fish","Shellfish","Molluscs","Peanuts","TreeNuts","Wheat/Gluten","Soy","Sesame","Mustard","Celery","Lupin","Sulphites"]
["ING001","Beef mince","Meat","Local Butcher",{"v":45,"d":"$45.00"},{"v":5,"d":"5.00"},"kg","Weight","g",{"$f":"IF($B2=\"\",\"\",IF($H2=\"Weight\",$F2*VLOOKUP(\"Weight|\"&$G2,UOM_Conversions!$A$2:$E$50,4,FALSE),IF($H2=\"Volume\",$F2*VLOOKUP(\"Volume|\"&$G2,UOM_Conversions!$A$2:$E$50,4,FALSE),$F2*VLOOKUP(\"Each|\"&$G2,UOM_Conversions!$A$2:$E$50,4,FALSE))))","v":{"v":5000,"d":"5000.00"}},{"$f":"IF($B2=\"\",\"\",IFERROR($E2/$J2,0))","v":{"v":0.009,"d":"$0.01"}},null,0,0,0,0,0,0,0,0,0,0,0,0,0,0]
["ING002","Burger bun","Bakery","Bakery Co",{"v":18,"d":"$18.00"},{"v":24,"d":"24.00"},"each","Each","each",{"$f":"IF($B3=\"\",\"\",IF($H3=\"Weight\",$F3*VLOOKUP(\"Weight|\"&$G3,UOM_Conversions!$A$2:$E$50,4,FALSE),IF($H3=\"Volume\",$F3*VLOOKUP(\"Volume|\"&$G3,UOM_Conversions!$A$2:$E$50,4,FALSE),$F3*VLOOKUP(\"Each|\"&$G3,UOM_Conversions!$A$2:$E$50,4,FALSE))))","v":{"v":24,"d":"24.00"}},{"v":0.75,"d":"$0.75"},null,0,0,0,0,0,0,0,1,0,0,0,0,0,0]
["ING003","Cheddar cheese","Dairy","Dairy Supplier",{"v":22,"d":"$22.00"},{"v":2,"d":"2.00"},"kg","Weight","g",{"$f":"IF($B4=\"\",\"\",IF($H4=\"Weight\",$F4*VLOOKUP(\"Weight|\"&$G4,UOM_Conversions!$A$2:$E$50,4,FALSE),IF($H4=\"Volume\",$F4*VLOOKUP(\"Volume|\"&$G4,UOM_Conversions!$A$2:$E$50,4,FALSE),$F4*VLOOKUP(\"Each|\"&$G4,UOM_Conversions!$A$2:$E$50,4,FALSE))))","v":{"v":2000,"d":"2000.00"}},{"v":0.011,"d":"$0.01"},null,1,0,0,0,0,0,0,0,0,0,0,0,0,0]
["ING004","Lettuce","Produce","Fresh Farms",{"v":8,"d":"$8.00"},{"v":1,"d":"1.00"},"kg","Weight","g",{"$f":"IF($B5=\"\",\"\",IF($H5=\"Weight\",$F5*VLOOKUP(\"Weight|\"&$G5,UOM_Conversions!$A$2:$E$50,4,FALSE),IF($H5=\"Volume\",$F5*VLOOKUP(\"Volume|\"&$G5,UOM_Conversions!$A$2:$E$50,4,FALSE),$F5*VLOOKUP(\"Each|\"&$G5,UOM_Conversions!$A$2:$E$50,4,FALSE))))","v":{"v":1000,"d":"1000.00"}},{"v":0.008,"d":"$0.01"},null,0,0,0,0,0,0,0,0,0,0,0,0,0,0]
["ING005","Ketchup","Condiments","Foodservice",{"v":12,"d":"$12.00"},{"v":3,"d":"3.00"},"kg","Weight","g",{"$f":"IF($B6=\"\",\"\",IF($H6=\"Weight\",$F6*VLOOKUP(\"Weight|\"&$G6,UOM_Conversions!$A$2:$E$50,4,FALSE),IF($H6=\"Volume\",$F6*VLOOKUP(\"Volume|\"&$G6,UOM_Conversions!$A$2:$E$50,4,FALSE),$F6*VLOOKUP(\"Each|\"&$G6,UOM_Conversions!$A$2:$E$50,4,FALSE))))","v":{"v":3000,"d":"3000.00"}},{"v":0.004,"d":"$0.00"},null,0,0,0,0,0,0,0,0,0,0,0,0,0,0]
["ING006","Mayonnaise","Condiments","Foodservice",{"v":15,"d":"$15.00"},{"v":2,"d":"2.00"},"kg","Weight","g",{"$f":"IF($B7=\"\",\"\",IF($H7=\"Weight\",$F7*VLOOKUP(\"Weight|\"&$G7,UOM_Conversions!$A$2:$E$50,4,FALSE),IF($H7=\"Volume\",$F7*VLOOKUP(\"Volume|\"&$G7,UOM_Conversions!$A$2:$E$50,4,FALSE),$F7*VLOOKUP(\"Each|\"&$G7,UOM_Conversions!$A$2:$E$50,4,FALSE))))","v":{"v":2000,"d":"2000.00"}},{"v":0.0075,"d":"$0.01"},null,0,1,0,0,0,0,0,0,1,0,0,0,0,0]
["ING007","French fries (frozen)","Frozen","Foodservice",{"v":28,"d":"$28.00"},{"v":10,"d":"10.00"},"kg","Weight","g",{"$f":"IF($B8=\"\",\"\",IF($H8=\"Weight\",$F8*VLOOKUP(\"Weight|\"&$G8,UOM_Conversions!$A$2:$E$50,4,FALSE),IF($H8=\"Volume\",$F8*VLOOKUP(\"Volume|\"&$G8,UOM_Conversions!$A$2:$E$50,4,FALSE),$F8*VLOOKUP(\"Each|\"&$G8,UOM_Conversions!$A$2:$E$50,4,FALSE))))","v":{"v":10000,"d":"10000.00"}},{"v":2.8E-3,"d":"$0.00"},null,0,0,0,0,0,0,0,0,0,0,0,0,0,0]
["ING008","Sesame seeds","Dry goods","Foodservice",{"v":10,"d":"$10.00"},{"v":1,"d":"1.00"},"kg","Weight","g",{"$f":"IF($B9=\"\",\"\",IF($H9=\"Weight\",$F9*VLOOKUP(\"Weight|\"&$G9,UOM_Conversions!$A$2:$E$50,4,FALSE),IF($H9=\"Volume\",$F9*VLOOKUP(\"Volume|\"&$G9,UOM_Conversions!$A$2:$E$50,4,FALSE),$F9*VLOOKUP(\"Each|\"&$G9,UOM_Conversions!$A$2:$E$50,4,FALSE))))","v":{"v":1000,"d":"1000.00"}},{"v":0.01,"d":"$0.01"},null,0,0,0,0,0,0,0,0,0,1,0,0,0,0]
[{"$nulls":9},{"$f":"IF($B10=\"\",\"\",IF($H10=\"Weight\",$F10*VLOOKUP(\"Weight|\"&$G10,UOM_Conversions!$A$2:$E$50,4,FALSE),IF($H10=\"Volume\",$F10*VLOOKUP(\"Volume|\"&$G10,UOM_Conversions!$A$2:$E$50,4,FALSE),$F10*VLOOKUP(\"Each|\"&$G10,UOM_Conversions!$A$2:$E$50,4,FALSE))))","v":""},""]
[{"$nulls":9},{"$f":"IF($B11=\"\",\"\",IF($H11=\"Weight\",$F11*VLOOKUP(\"Weight|\"&$G11,UOM_Conversions!$A$2:$E$50,4,FALSE),IF($H11=\"Volume\",$F11*VLOOKUP(\"Volume|\"&$G11,UOM_Conversions!$A$2:$E$50,4,FALSE),$F11*VLOOKUP(\"Each|\"&$G11,UOM_Conversions!$A$2:$E$50,4,FALSE))))","v":""},""]
[{"$nulls":9},{"$f":"IF($B12=\"\",\"\",IF($H12=\"Weight\",$F12*VLOOKUP(\"Weight|\"&$G12,UOM_Conversions!$A$2:$E$50,4,FALSE),IF($H12=\"Volume\",$F12*VLOOKUP(\"Volume|\"&$G12,UOM_Conversions!$A$2:$E$50,4,FALSE),$F12*VLOOKUP(\"Each|\"&$G12,UOM_Conversions!$A$2:$E$50,4,FALSE))))","v":""},""]
[{"$nulls":9},{"$f":"IF($B13=\"\",\"\",IF($H13=\"Weight\",$F13*VLOOKUP(\"Weight|\"&$G13,UOM_Conversions!$A$2:$E$50,4,FALSE),IF($H13=\"Volume\",$F13*VLOOKUP(\"Volume|\"&$G13,UOM_Conversions!$A$2:$E$50,4,FALSE),$F13*VLOOKUP(\"Each|\"&$G13,UOM_Conversions!$A$2:$E$50,4,FALSE))))","v":""},""]
[{"$nulls":9},{"$f":"IF($B14=\"\",\"\",IF($H14=\"Weight\",$F14*VLOOKUP(\"Weight|\"&$G14,UOM_Conversions!$A$2:$E$50,4,FALSE),IF($H14=\"Volume\",$F14*VLOOKUP(\"Volume|\"&$G14,UOM_Conversions!$A$2:$E$50,4,FALSE),$F14*VLOOKUP(\"Each|\"&$G14,UOM_Conversions!$A$2:$E$50,4,FALSE))))","v":""},""]
[{"$nulls":9},{"$f":"IF($B15=\"\",\"\",IF($H15=\"Weight\",$F15*VLOOKUP(\"Weight|\"&$G15,UOM_Conversions!$A$2:$E$50,4,FALSE),IF($H15=\"Volume\",$F15*VLOOKUP(\"Volume|\"&$G15,UOM_Conversions!$A$2:$E$50,4,FALSE),$F15*VLOOKUP(\"Each|\"&$G15,UOM_Conversions!$A$2:$E$50,4,FALSE))))","v":""},""]
[{"$nulls":9},{"$f":"IF($B16=\"\",\"\",IF($H16=\"Weight\",$F16*VLOOKUP(\"Weight|\"&$G16,UOM_Conversions!$A$2:$E$50,4,FALSE),IF($H16=\"Volume\",$F16*VLOOKUP(\"Volume|\"&$G16,UOM_Conversions!$A$2:$E$50,4,FALSE),$F16*VLOOKUP(\"Each|\"&$G16,UOM_Conversions!$A$2:$E$50,4,FALSE))))","v":""},""]
[{"$nulls":9},{"$f":"IF($B17=\"\",\"\",IF($H17=\"Weight\",$F17*VLOOKUP(\"Weight|\"&$G17,UOM_Conversions!$A$2:$E$50,4,FALSE),IF($H17=\"Volume\",$F17*VLOOKUP(\"Volume|\"&$G17,UOM_Conversions!$A$2:$E$50,4,FALSE),$F17*VLOOKUP(\"Each|\"&$G17,UOM_Conversions!$A$2:$E$50,4,FALSE))))","v":""},""]
[{"$nulls":9},{"$f":"IF($B18=\"\",\"\",IF($H18=\"Weight\",$F18*VLOOKUP(\"Weight|\"&$G18,UOM_Conversions!$A$2:$E$50,4,FALSE),IF($H18=\"Volume\",$F18*VLOOKUP(\"Volume|\"&$G18,UOM_Conversions!$A$2:$E$50,4,FALSE),$F18*VLOOKUP(\"Each|\"&$G18,UOM_Conversions!$A$2:$E$50,4,FALSE))))","v":""},""]
[{"$nulls":9},{"$f":"IF($B19=\"\",\"\",IF($H19=\"Weight\",$F19*VLOOKUP(\"Weight|\"&$G19,UOM_Conversions!$A$2:$E$50,4,FALSE),IF($H19=\"Volume\",$F19*VLOOKUP(\"Volume|\"&$G19,UOM_Conversions!$A$2:$E$50,4,FALSE),$F19*VLOOKUP(\"Each|\"&$G19,UOM_Conversions!$A$2:$E$50,4,FALSE))))","v":""},""]
[{"$nulls":9},{"$f":"IF($B20=\"\",\"\",IF($H20=\"Weight\",$F20*VLOOKUP(\"Weight|\"&$G20,UOM_Conversions!$A$2:$E$50,4,FALSE),IF($H20=\"Volume\",$F20*VLOOKUP(\"Volume|\"&$G20,UOM_Conversions!$A$2:$E$50,4,FALSE),$F20*VLOOKUP(\"Each|\"&$G20,UOM_Conversions!$A$2:$E$50,4,FALSE))))","v":""},""]
{"$rows_left_out":482}
{"sheet":"UOM_Conversions","index":3,"n_rows":12,"n_cols":7,"rows_kept":12}
["Key","Type","Unit","ToBaseFactor","BaseUnit",null,"Units_List"]
["Weight|g","Weight","g",{"v":1,"d":"1.00"},"g",null,"g"]
["Weight|kg","Weight","kg",{"v":1000,"d":"1000.00"},"g",null,"kg"]
["Weight|oz","Weight","oz",{"v":28.349523125,"d":"28.35"},"g",null,"oz"]
["Weight|lb","Weight","lb",{"v":453.59237,"d":"453.59"},"g",null,"lb"]
["Volume|ml","Volume","ml",{"v":1,"d":"1.00"},"ml",null,"ml"]
["Volume|l","Volume","l",{"v":1000,"d":"1000.00"},"ml",null,"l"]
["Volume|tsp","Volume","tsp",{"v":4.928921594,"d":"4.93"},"ml",null,"tsp"]
["Volume|tbsp","Volume","tbsp",{"v":14.786764781,"d":"14.79"},"ml",null,"tbsp"]
["Volume|cup","Volume","cup",{"v":236.5882365,"d":"236.59"},"ml",null,"cup"]
["Each|each","Each","each",{"v":1,"d":"1.00"},"each",null,"each"]
["Each|dozen","Each","dozen",{"v":12,"d":"12.00"},"each",null,"dozen"]

{"sheet":"HowTo","index":4,"n_rows":88,"n_cols":26,"rows_kept":88}
[null,"HOW TO USE THIS RECIPE COST WORKBOOK",{"$nulls":23},{"$f":"SUBSTITUTE(SUBSTITUTE(LEFT(CELL(\"filename\",B1),FIND(\"]\",CELL(\"filename\",B1))),\"[\",\"\"),\"]\",\"\")","v":"C:\\HFPNet\\Food_Recipe_Costing_Template.xlsm"}]
[]
[null,"Purpose"]
[null,"This workbook helps you:"]
[null,"1. Cost each menu item using one sheet per recipe"]
[null,"2. Automatically build a Summary table across all recipes using Power Query"]
[null,"3. copy and create new recipe sheets with click of a button"]
[null,"4. Track key KPIs: Cost/Portion, Food Cost %, Last Updated"]
[null,"5. Easy navogation summary sheet to recipes and back to summary"]
[]
[null,"Quick Start (3 steps)"]
[null,"1. Create a new recipe sheet by copying TEMPLATE"]
[null,"2. Fill the recipe sheet (ingredients + header details)"]
[null,"3. Save → Data → Refresh All to update the Summary"]
[]
[null,"1) Add a New Recipe (Recommended Workflow)"]
[null,"1. Click on Add new recipe button"]
[null,"2. Type in the recipe name on the popup"]
[null,"3. Update these header cells on the recipe sheet:"]
[]
{"$rows_left_out":69}
{"sheet":"Example 1","index":5,"n_rows":50,"n_cols":31,"rows_kept":50,"merged":[[1,12,14,12],[19,10,49,12]]}
["RECIPE COST CARD",{"$nulls":9},"ALLERGEN SUMMARY (from ingredient flags)",{"$nulls":3},"For calculation (do not delete)"]
["Restaurant / Concept",null,"Demo Restaurant",null,"Last Updated","2026-02-02",{"$nulls":4},"Milk",{"$f":"IF(MAX(R21:R50)>0,\"YES\",\"\")","v":"YES"},"(e.g., gluten-free option? vegan? substitution guidance, allergen handling, etc.)"]
["Menu Item Name",null,"Example 1",{"$nulls":3},"Currency 1","Currency 2","Notes",null,"Egg",{"$f":"IF(MAX(S21:S50)>0,\"YES\",\"\")","v":"YES"}]
["Category",null,"Starter",null,"Total Batch Food Cost",null,{"$f":"IFERROR(SUM(H21:H50),0)","v":{"v":3.820921052631579,"d":"$3.82"}},null,"SUM(G21:G50)",null,"Fish",{"$f":"IF(MAX(T21:T50)>0,\"YES\",\"\")","v":""}]
["Station",null,"Grill",null,"Other Costs (packaging etc.)",{"$nulls":3},"IFERROR(SUM($G$14:$G$17),0)",null,"Shellfish",{"$f":"IF(MAX(U21:U50)>0,\"YES\",\"\")","v":""}]
["Batch Yield (portions)",null,1,null,"Total Batch Cost",null,{"$f":"G4+G5","v":{"v":3.820921052631579,"d":"$3.82"}},{"$nulls":3},"Molluscs",{"$f":"IF(MAX(V21:V50)>0,\"YES\",\"\")","v":""}]
["Portion Size",null,"1 burger + fries",null,"Cost / Portion",null,{"$f":"IFERROR(G6/$C$6,0)","v":{"v":3.820921052631579,"d":"$3.82"}},{"$nulls":3},"Peanuts",{"$f":"IF(MAX(W21:W50)>0,\"YES\",\"\")","v":""}]
["Selling Price / Portion",null,{"v":16,"d":"$16.00"},null,"Food Cost %",null,{"$f":"IFERROR(G7/$C$8,0)","v":{"v":0.23880756578947368,"d":"23.9%"}},{"$nulls":3},"Tree Nuts",{"$f":"IF(MAX(X21:X50)>0,\"YES\",\"\")","v":""}]
["Target Food Cost %",null,{"v":0.3,"d":"30.0%"},null,"Gross Profit / Portion",null,{"$f":"IFERROR($C$8-G7,0)","v":{"v":12.17907894736842,"d":"$12.18"}},{"$nulls":3},"Wheat/Gluten",{"$f":"IF(MAX(Y21:Y50)>0,\"YES\",\"\")","v":"YES"}]
["Prep Time (min)",null,10,null,"Gross Margin %",null,{"$f":"IFERROR(1-G8,0)","v":{"v":0.7611924342105263,"d":"76.1%"}},{"$nulls":3},"Soy",{"$f":"IF(MAX(Z21:Z50)>0,\"YES\",\"\")","v":"YES"}]
["Cook Time (min)",null,8,{"$nulls":7},"Sesame",{"$f":"IF(MAX(AA21:AA50)>0,\"YES\",\"\")","v":"YES"}]
["Shelf Life / Storage",null,"Hold cold 2 days; cook to order",null,"OTHER COSTS (not part of cost of sale in hotels and resorts)",{"$nulls":5},"Mustard",{"$f":"IF(MAX(AB21:AB50)>0,\"YES\",\"\")","v":""}]
[{"$nulls":4},"Description",null,"Cost",null,"Notes",null,"Celery",{"$f":"IF(MAX(AC21:AC50)>0,\"YES\",\"\")","v":""}]
[{"$nulls":4},"Packaging",null,{"v":0.25,"d":"$0.25"},{"$nulls":3},"Lupin",{"$f":"IF(MAX(AD21:AD50)>0,\"YES\",\"\")","v":""}]
[{"$nulls":4},"Napkin/condiment cup",null,{"v":0.1,"d":"$0.10"},{"$nulls":3},"Sulphites",{"$f":"IF(MAX(AE21:AE50)>0,\"YES\",\"\")","v":""}]
[{"$nulls":6},{"v":0,"d":"$0.00"}]
[{"$nulls":6},{"v":0,"d":"$0.00"}]
[]
["INGREDIENTS (enter Qty + Unit; costs auto-calc)",{"$nulls":4},"Actual Qty","Unit Cost",{"$nulls":3},"PREPARATION METHOD"]
["Line","Ingredient","Qty","Unit","Yield %","in base units","(per base)","Line Cost","Notes",null,"Step-by-step method - \n\ncritical control points - \n\nholding temps - \n\nplating - \n\ncross-contamination notes - "]
{"$rows_left_out":31}
{"sheet":"Example 2","index":6,"n_rows":50,"n_cols":31,"rows_kept":50,"merged":[[1,12,14,12],[19,10,49,12]]}
["RECIPE COST CARD",{"$nulls":9},"ALLERGEN SUMMARY (from ingredient flags)",{"$nulls":3},"For calculation (do not delete)"]
["Restaurant / Concept",null,"Demo Restaurant",null,"Last Updated","2026-02-02",{"$nulls":4},"Milk",{"$f":"IF(MAX(R21:R50)>0,\"YES\",\"\")","v":"YES"},"(e.g., gluten-free option? vegan? substitution guidance, allergen handling, etc.)"]
["Menu Item Name",null,"Example 2",{"$nulls":3},"Currency 1","Currency 2","Notes",null,"Egg",{"$f":"IF(MAX(S21:S50)>0,\"YES\",\"\")","v":"YES"}]
["Category",null,"Starter",null,"Total Batch Food Cost",null,{"$f":"IFERROR(SUM(H21:H50),0)","v":{"v":3.820921052631579,"d":"$3.82"}},null,"SUM(G21:G50)",null,"Fish",{"$f":"IF(MAX(T21:T50)>0,\"YES\",\"\")","v":""}]
["Station",null,"Grill",null,"Other Costs (packaging etc.)",{"$nulls":3},"IFERROR(SUM($G$14:$G$17),0)",null,"Shellfish",{"$f":"IF(MAX(U21:U50)>0,\"YES\",\"\")","v":""}]
["Batch Yield (portions)",null,1,null,"Total Batch Cost",null,{"$f":"G4+G5","v":{"v":3.820921052631579,"d":"$3.82"}},{"$nulls":3},"Molluscs",{"$f":"IF(MAX(V21:V50)>0,\"YES\",\"\")","v":""}]
["Portion Size",null,"1 burger + fries",null,"Cost / Portion",null,{"$f":"IFERROR(G6/$C$6,0)","v":{"v":3.820921052631579,"d":"$3.82"}},{"$nulls":3},"Peanuts",{"$f":"IF(MAX(W21:W50)>0,\"YES\",\"\")","v":""}]
["Selling Price / Portion",null,{"v":16,"d":"$16.00"},null,"Food Cost %",null,{"$f":"IFERROR(G7/$C$8,0)","v":{"v":0.23880756578947368,"d":"23.9%"}},{"$nulls":3},"Tree Nuts",{"$f":"IF(MAX(X21:X50)>0,\"YES\",\"\")","v":""}]
["Target Food Cost %",null,{"v":0.3,"d":"30.0%"},null,"Gross Profit / Portion",null,{"$f":"IFERROR($C$8-G7,0)","v":{"v":12.17907894736842,"d":"$12.18"}},{"$nulls":3},"Wheat/Gluten",{"$f":"IF(MAX(Y21:Y50)>0,\"YES\",\"\")","v":"YES"}]
["Prep Time (min)",null,10,null,"Gross Margin %",null,{"$f":"IFERROR(1-G8,0)","v":{"v":0.7611924342105263,"d":"76.1%"}},{"$nulls":3},"Soy",{"$f":"IF(MAX(Z21:Z50)>0,\"YES\",\"\")","v":"YES"}]
["Cook Time (min)",null,8,{"$nulls":7},"Sesame",{"$f":"IF(MAX(AA21:AA50)>0,\"YES\",\"\")","v":"YES"}]
["Shelf Life / Storage",null,"Hold cold 2 days; cook to order",null,"OTHER COSTS (not part of cost of sale in hotels and resorts)",{"$nulls":5},"Mustard",{"$f":"IF(MAX(AB21:AB50)>0,\"YES\",\"\")","v":""}]
[{"$nulls":4},"Description",null,"Cost",null,"Notes",null,"Celery",{"$f":"IF(MAX(AC21:AC50)>0,\"YES\",\"\")","v":""}]
[{"$nulls":4},"Packaging",null,{"v":0.25,"d":"$0.25"},{"$nulls":3},"Lupin",{"$f":"IF(MAX(AD21:AD50)>0,\"YES\",\"\")","v":""}]
[{"$nulls":4},"Napkin/condiment cup",null,{"v":0.1,"d":"$0.10"},{"$nulls":3},"Sulphites",{"$f":"IF(MAX(AE21:AE50)>0,\"YES\",\"\")","v":""}]
[{"$nulls":6},{"v":0,"d":"$0.00"}]
[{"$nulls":6},{"v":0,"d":"$0.00"}]
[]
["INGREDIENTS (enter Qty + Unit; costs auto-calc)",{"$nulls":4},"Actual Qty","Unit Cost",{"$nulls":3},"PREPARATION METHOD"]
["Line","Ingredient","Qty","Unit","Yield %","in base units","(per base)","Line Cost","Notes",null,"Step-by-step method - \n\ncritical control points - \n\nholding temps - \n\nplating - \n\ncross-contamination notes - "]
{"$rows_left_out":31}
{"sheet":"Example 3","index":7,"n_rows":50,"n_cols":31,"rows_kept":50,"merged":[[1,12,14,12],[19,10,49,12]]}
["RECIPE COST CARD",{"$nulls":9},"ALLERGEN SUMMARY (from ingredient flags)",{"$nulls":3},"For calculation (do not delete)"]
["Restaurant / Concept",null,"Demo Restaurant",null,"Last Updated","2026-02-06",{"$nulls":4},"Milk",{"$f":"IF(MAX(R21:R50)>0,\"YES\",\"\")","v":"YES"},"(e.g., gluten-free option? vegan? substitution guidance, allergen handling, etc.)"]
["Menu Item Name",null,"Example 3",{"$nulls":3},"Currency 1","Currency 2","Notes",null,"Egg",{"$f":"IF(MAX(S21:S50)>0,\"YES\",\"\")","v":"YES"}]
["Category",null,"Starter",null,"Total Batch Food Cost",null,{"$f":"IFERROR(SUM(H21:H50),0)","v":{"v":3.820921052631579,"d":"$3.82"}},null,"SUM(G21:G50)",null,"Fish",{"$f":"IF(MAX(T21:T50)>0,\"YES\",\"\")","v":""}]
["Station",null,"Grill",null,"Other Costs (packaging etc.)",{"$nulls":3},"IFERROR(SUM($G$14:$G$17),0)",null,"Shellfish",{"$f":"IF(MAX(U21:U50)>0,\"YES\",\"\")","v":""}]
["Batch Yield (portions)",null,1,null,"Total Batch Cost",null,{"$f":"G4+G5","v":{"v":3.820921052631579,"d":"$3.82"}},{"$nulls":3},"Molluscs",{"$f":"IF(MAX(V21:V50)>0,\"YES\",\"\")","v":""}]
["Portion Size",null,"1 burger + fries",null,"Cost / Portion",null,{"$f":"IFERROR(G6/$C$6,0)","v":{"v":3.820921052631579,"d":"$3.82"}},{"$nulls":3},"Peanuts",{"$f":"IF(MAX(W21:W50)>0,\"YES\",\"\")","v":""}]
["Selling Price / Portion",null,{"v":16,"d":"$16.00"},null,"Food Cost %",null,{"$f":"IFERROR(G7/$C$8,0)","v":{"v":0.23880756578947368,"d":"23.9%"}},{"$nulls":3},"Tree Nuts",{"$f":"IF(MAX(X21:X50)>0,\"YES\",\"\")","v":""}]
["Target Food Cost %",null,{"v":0.3,"d":"30.0%"},null,"Gross Profit / Portion",null,{"$f":"IFERROR($C$8-G7,0)","v":{"v":12.17907894736842,"d":"$12.18"}},{"$nulls":3},"Wheat/Gluten",{"$f":"IF(MAX(Y21:Y50)>0,\"YES\",\"\")","v":"YES"}]
["Prep Time (min)",null,10,null,"Gross Margin %",null,{"$f":"IFERROR(1-G8,0)","v":{"v":0.7611924342105263,"d":"76.1%"}},{"$nulls":3},"Soy",{"$f":"IF(MAX(Z21:Z50)>0,\"YES\",\"\")","v":"YES"}]
["Cook Time (min)",null,8,{"$nulls":7},"Sesame",{"$f":"IF(MAX(AA21:AA50)>0,\"YES\",\"\")","v":"YES"}]
["Shelf Life / Storage",null,"Hold cold 2 days; cook to order",null,"OTHER COSTS (not part of cost of sale in hotels and resorts)",{"$nulls":5},"Mustard",{"$f":"IF(MAX(AB21:AB50)>0,\"YES\",\"\")","v":""}]
[{"$nulls":4},"Description",null,"Cost",null,"Notes",null,"Celery",{"$f":"IF(MAX(AC21:AC50)>0,\"YES\",\"\")","v":""}]
[{"$nulls":4},"Packaging",null,{"v":0.25,"d":"$0.25"},{"$nulls":3},"Lupin",{"$f":"IF(MAX(AD21:AD50)>0,\"YES\",\"\")","v":""}]
[{"$nulls":4},"Napkin/condiment cup",null,{"v":0.1,"d":"$0.10"},{"$nulls":3},"Sulphites",{"$f":"IF(MAX(AE21:AE50)>0,\"YES\",\"\")","v":""}]
[{"$nulls":6},{"v":0,"d":"$0.00"}]
[{"$nulls":6},{"v":0,"d":"$0.00"}]
[]
["INGREDIENTS (enter Qty + Unit; costs auto-calc)",{"$nulls":4},"Actual Qty","Unit Cost",{"$nulls":3},"PREPARATION METHOD"]
["Line","Ingredient","Qty","Unit","Yield %","in base units","(per base)","Line Cost","Notes",null,"Step-by-step method - \n\ncritical control points - \n\nholding temps - \n\nplating - \n\ncross-contamination notes - "]
{"$rows_left_out":31}
{"sheet":"_NAV_STATE","index":8,"n_rows":6,"n_cols":2,"rows_kept":6,"hidden":true}
["Summary","Example 1"]
["F4","C8"]
["Example 1",1]
[4,1]
[2,100]
[115]