{"text_format":"3","workbook":"xlsx","n_sheets":9,"sheets":["Summary","Template","Ingredients_DB","UOM_Conversions","HowTo","Example 1","Example 2","Example 3","_NAV_STATE"],"not_rendered":{"macros":1,"defined_names":5},"read":"whole","date_system":"1900"}

{"sheet":"Summary","index":0,"n_rows":6,"n_cols":9,"rows_kept":6}
[null,"MENU RECIPE COST SUMMARY"]
[null,"Hospitality Finance Network"]
[null,"SheetName","Menu Item","Category","Yield (portions)","Sell Price","Cost/Portion","Food Cost %","Last Updated"]
[null,"Example 1","Example 1","Starter",1,{"v":16,"d":"16.00"},{"v":3.820921052631579,"d":"3.82"},{"v":0.23880756578947368,"d":"24%"},"2026-02-02"]
[null,"Example 2","Example 2","Starter",1,{"v":16,"d":"16.00"},{"v":3.820921052631579,"d":"3.82"},{"v":0.23880756578947368,"d":"24%"},"2026-02-02"]
[null,"Example 3","Example 3","Starter",1,{"v":16,"d":"16.00"},{"v":3.820921052631579,"d":"3.82"},{"v":0.23880756578947368,"d":"24%"},"2026-02-06"]

{"sheet":"Template","index":1,"n_rows":50,"n_cols":31,"rows_kept":50,"merged":[[1,12,14,12],[19,10,49,12]]}
["RECIPE COST CARD",{"$nulls":9},"ALLERGEN SUMMARY (from ingredient flags)",{"$nulls":3},"For calculation (do not delete)"]
["Restaurant / Concept",null,"Demo Restaurant",null,"Last Updated","2026-01-31",{"$nulls":4},"Milk",{"$f":"IF(MAX(R21:R50)>0,\"YES\",\"\")","v":"YES"},"(e.g., gluten-free option? vegan? substitution guidance, allergen handling, etc.)"]
["Menu Item Name",null,"Classic Cheeseburger",{"$nulls":3},"Currency 1","Currency 2","Notes",null,"Egg",{"$f":"IF(MAX(S21:S50)>0,\"YES\",\"\")","v":"YES"}]
["Category",null,"Starter",null,"Total Batch Food Cost",null,{"$f":"IFERROR(SUM(H21:H50),0)","v":{"v":3.820921052631579,"d":"$3.82"}},null,"SUM(G21:G50)",null,"Fish",{"$f":"IF(MAX(T21:T50)>0,\"YES\",\"\")","v":""}]
["Station",null,"Grill",null,"Other Costs (packaging etc.)",{"$nulls":3},"IFERROR(SUM($G$14:$G$17),0)",null,"Shellfish",{"$f":"IF(MAX(U21:U50)>0,\"YES\",\"\")","v":""}]
["Batch Yield (portions)",null,1,null,"Total Batch Cost",null,{"$f":"G4+G5","v":{"v":3.820921052631579,"d":"$3.82"}},{"$nulls":3},"Molluscs",{"$f":"IF(MAX(V21:V50)>0,\"YES\",\"\")","v":""}]
["Portion Size",null,"1 burger + fries",null,"Cost / Portion",null,{"$f":"IFERROR(G6/$C$6,0)","v":{"v":3.820921052631579,"d":"$3.82"}},{"$nulls":3},"Peanuts",{"$f":"IF(MAX(W21:W50)>0,\"YES\",\"\")","v":""}]
["Selling Price / Portion",null,{"v":16,"d":"$16.00"},null,"Food Cost %",null,{"$f":"IFERROR(G7/$C$8,0)","v":{"v":0.23880756578947368,"d":"23.9%"}},{"$nulls":3},"Tree Nuts",{"$f":"IF(MAX(X21:X50)>0,\"YES\",\"\")","v":""}]
["Target Food Cost %",null,{"v":0.3,"d":"30.0%"},null,"Gross Profit / Portion",null,{"$f":"IFERROR($C$8-G7,0)","v":{"v":12.17907894736842,"d":"$12.18"}},{"$nulls":3},"Wheat/Gluten",{"$f":"IF(MAX(Y21:Y50)>0,\"YES\",\"\")","v":"YES"}]
["Prep Time (min)",null,10,null,"Gross Margin %",null,{"$f":"IFERROR(1-G8,0)","v":{"v":0.7611924342105263,"d":"76.1%"}},{"$nulls":3},"Soy",{"$f":"IF(MAX(Z21:Z50)>0,\"YES\",\"\")","v":"YES"}]
["Cook Time (min)",null,8,{"$nulls":7},"Sesame",{"$f":"IF(MAX(AA21:AA50)>0,\"YES\",\"\")","v":"YES"}]
["Shelf Life / Storage",null,"Hold cold 2 days; cook to order",null,"OTHER COSTS (not part of cost of sale in hotels and resorts)",{"$nulls":5},"Mustard",{"$f":"IF(MAX(AB21:AB50)>0,\"YES\",\"\")","v":""}]
[{"$nulls":4},"Description",null,"Cost",null,"Notes",null,"Celery",{"$f":"IF(MAX(AC21:AC50)>0,\"YES\",\"\")","v":""}]
[{"$nulls":4},"Packaging",null,{"v":0.25,"d":"$0.25"},{"$nulls":3},"Lupin",{"$f":"IF(MAX(AD21:AD50)>0,\"YES\",\"\")","v":""}]
[{"$nulls":4},"Napkin/condiment cup",null,{"v":0.1,"d":"$0.10"},{"$nulls":3},"Sulphites",{"$f":"IF(MAX(AE21:AE50)>0,\"YES\",\"\")","v":""}]
[{"$nulls":6},{"v":0,"d":"$0.00"}]
[{"$nulls":6},{"v":0,"d":"$0.00"}]
[]
["INGREDIENTS (enter Qty + Unit; costs auto-calc)",{"$nulls":4},"Actual Qty","Unit Cost",{"$nulls":3},"PREPARATION METHOD"]
["Line","Ingredient","Qty","Unit","Yield %","in base units","(per base)","Line Cost","Notes",null,"Step-by-step method - \n\ncritical control points - \n\nholding temps - \n\nplating - \n\ncross-contamination notes - "]
[1,"Beef mince",{"v":180,"d":"180.00"},"g",{"v":0.9,"d":"90%"},{"$f":"IF($B21=\"\",\"\",IF(ISNUMBER($Q21),$C21*$Q21/E21,\"\"))","v":{"v":200,"d":"200.00"}},{"$f":"IF($B21=\"\",\"\",IFERROR(INDEX(Ingredients_DB!$K$2:$K$501, MATCH($B21, Ingredients_DB!$B$2:$B$501,0)),0))","v":{"v":0.009,"d":"$0.01"}},{"$f":"IF($B21=\"\",\"\",IF(ISNUMBER($F21),$F21*$G21,\"\"))","v":{"v":1.7999999999999998,"d":"$1.80"}},"Patty 180g",{"$nulls":5},{"$f":"IF($B21=\"\",\"\",IFERROR(INDEX(Ingredients_DB!$H$2:$H$501, MATCH($B21, Ingredients_DB!$B$2:$B$501,0)),\"\"))","v":"Weight"},{"$f":"IF($B21=\"\",\"\",IFERROR(INDEX(Ingredients_DB!$I$2:$I$501, MATCH($B21, Ingredients_DB!$B$2:$B$501,0)),\"\"))","v":"g"},{"$f":"IF($B21=\"\",\"\",IFERROR(VLOOKUP($O21&\"|\"&$D21,UOM_Conversions!$A$2:$E$50,4,FALSE),\"CHECK UNIT\"))","v":1},{"$f":"IF($B21=\"\",\"\",IFERROR(INDEX(Ingredients_DB!$M$2:$M$501, MATCH($B21, Ingredients_DB!$B$2:$B$501,0)),0))","v":0},{"$f":"IF($B21=\"\",\"\",IFERROR(INDEX(Ingredients_DB!$N$2:$N$501, MATCH($B21, Ingredients_DB!$B$2:$B$501,0)),0))","v":0},{"$f":"IF($B21=\"\",\"\",IFERROR(INDEX(Ingredients_DB!$O$2:$O$501, MATCH($B21, Ingredients_DB!$B$2:$B$501,0)),0))","v":0},{"$f":"IF($B21=\"\",\"\",IFERROR(INDEX(Ingredients_DB!$P$2:$P$501, MATCH($B21, Ingredients_DB!$B$2:$B$501,0)),0))","v":0},{"$f":"IF($B21=\"\",\"\",IFERROR(INDEX(Ingredients_DB!$Q$2:$Q$501, MATCH($B21, Ingredients_DB!$B$2:$B$501,0)),0))","v":0},{"$f":"IF($B21=\"\",\"\",IFERROR(INDEX(Ingredients_DB!$R$2:$R$501, MATCH($B21, Ingredients_DB!$B$2:$B$501,0)),0))","v":0},{"$f":"IF($B21=\"\",\"\",IFERROR(INDEX(Ingredients_DB!$S$2:$S$501, MATCH($B21, Ingredients_DB!$B$2:$B$501,0)),0))","v":0},{"$f":"IF($B21=\"\",\"\",IFERROR(INDEX(Ingredients_DB!$T$2:$T$501, MATCH($B21, Ingredients_DB!$B$2:$B$501,0)),0))","v":0},{"$f":"IF($B21=\"\",\"\",IFERROR(INDEX(Ingredients_DB!$U$2:$U$501, MATCH($B21, Ingredients_DB!$B$2:$B$501,0)),0))","v":0},{"$f":"IF($B21=\"\",\"\",IFERROR(INDEX(Ingredients_DB!$V$2:$V$501, MATCH($B21, Ingredients_DB!$B$2:$B$501,0)),0))","v":0},{"$f":"IF($B21=\"\",\"\",IFERROR(INDEX(Ingredients_DB!$W$2:$W$501, MATCH($B21, Ingredients_DB!$B$2:$B$501,0)),0))","v":0},{"$f":"IF($B21=\"\",\"\",IFERROR(INDEX(Ingredients_DB!$X$2:$X$501, MATCH($B21, Ingredients_DB!$B$2:$B$501,0)),0))","v":0},{"$f":"IF($B21=\"\",\"\",IFERROR(INDEX(Ingredients_DB!$Y$2:$Y$501, MATCH($B21, Ingredients_DB!$B$2:$B$501,0)),0))","v":0},{"$f":"IF($B21=\"\",\"\",IFERROR(INDEX(Ingredients_DB!$Z$2:$Z$501, MATCH($B21, Ingredients_DB!$B$2:$B$501,0)),0))","v":0}]
[2,"Burger bun",{"v":1,"d":"1.00"},"each",{"v":1,"d":"100%"},{"v":1,"d":"1.00"},{"$f":"IF($B22=\"\",\"\",IFERROR(INDEX(Ingredients_DB!$K$2:$K$501, MATCH($B22, Ingredients_DB!$B$2:$B$501,0)),0))","v":{"v":0.75,"d":"$0.75"}},{"v":0.75,"d":"$0.75"},"Toasted",{"$nulls":5},{"$f":"IF($B22=\"\",\"\",IFERROR(INDEX(Ingredients_DB!$H$2:$H$501, MATCH($B22, Ingredients_DB!$B$2:$B$501,0)),\"\"))","v":"Each"},{"$f":"IF($B22=\"\",\"\",IFERROR(INDEX(Ingredients_DB!$I$2:$I$501, MATCH($B22, Ingredients_DB!$B$2:$B$501,0)),\"\"))","v":"each"},{"$f":"IF($B22=\"\",\"\",IFERROR(VLOOKUP($O22&\"|\"&$D22,UOM_Conversions!$A$2:$E$50,4,FALSE),\"CHECK UNIT\"))","v":1},{"$f":"IF($B22=\"\",\"\",IFERROR(INDEX(Ingredients_DB!$M$2:$M$501, MATCH($B22, Ingredients_DB!$B$2:$B$501,0)),0))","v":0},{"$f":"IF($B22=\"\",\"\",IFERROR(INDEX(Ingredients_DB!$N$2:$N$501, MATCH($B22, Ingredients_DB!$B$2:$B$501,0)),0))","v":0},{"$f":"IF($B22=\"\",\"\",IFERROR(INDEX(Ingredients_DB!$O$2:$O$501, MATCH($B22, Ingredients_DB!$B$2:$B$501,0)),0))","v":0},{"$f":"IF($B22=\"\",\"\",IFERROR(INDEX(Ingredients_DB!$P$2:$P$501, MATCH($B22, Ingredients_DB!$B$2:$B$501,0)),0))","v":0},{"$f":"IF($B22=\"\",\"\",IFERROR(INDEX(Ingredients_DB!$Q$2:$Q$501, MATCH($B22, Ingredients_DB!$B$2:$B$501,0)),0))","v":0},{"$f":"IF($B22=\"\",\"\",IFERROR(INDEX(Ingredients_DB!$R$2:$R$501, MATCH($B22, Ingredients_DB!$B$2:$B$501,0)),0))","v":0},{"$f":"IF($B22=\"\",\"\",IFERROR(INDEX(Ingredients_DB!$S$2:$S$501, MATCH($B22, Ingredients_DB!$B$2:$B$501,0)),0))","v":0},{"$f":"IF($B22=\"\",\"\",IFERROR(INDEX(Ingredients_DB!$T$2:$T$501, MATCH($B22, Ingredients_DB!$B$2:$B$501,0)),0))","v":1},{"$f":"IF($B22=\"\",\"\",IFERROR(INDEX(Ingredients_DB!$U$2:$U$501, MATCH($B22, Ingredients_DB!$B$2:$B$501,0)),0))","v":0},{"$f":"IF($B22=\"\",\"\",IFERROR(INDEX(Ingredients_DB!$V$2:$V$501, MATCH($B22, Ingredients_DB!$B$2:$B$501,0)),0))","v":0},{"$f":"IF($B22=\"\",\"\",IFERROR(INDEX(Ingredients_DB!$W$2:$W$501, MATCH($B22, Ingredients_DB!$B$2:$B$501,0)),0))","v":0},{"$f":"IF($B22=\"\",\"\",IFERROR(INDEX(Ingredients_DB!$X$2:$X$501, MATCH($B22, Ingredients_DB!$B$2:$B$501,0)),0))","v":0},{"$f":"IF($B22=\"\",\"\",IFERROR(INDEX(Ingredients_DB!$Y$2:$Y$501, MATCH($B22, Ingredients_DB!$B$2:$B$501,0)),0))","v":0},{"$f":"IF($B22=\"\",\"\",IFERROR(INDEX(Ingredients_DB!$Z$2:$Z$501, MATCH($B22, Ingredients_DB!$B$2:$B$501,0)),0))","v":0}]
[3,"Cheddar cheese",{"v":30,"d":"30.00"},"g",{"v":1,"d":"100%"},{"v":30,"d":"30.00"},{"$f":"IF($B23=\"\",\"\",IFERROR(INDEX(Ingredients_DB!$K$2:$K$501, MATCH($B23, Ingredients_DB!$B$2:$B$501,0)),0))","v":{"v":0.011,"d":"$0.01"}},{"v":0.32999999999999996,"d":"$0.33"},"Slice",{"$nulls":5},{"$f":"IF($B23=\"\",\"\",IFERROR(INDEX(Ingredients_DB!$H$2:$H$501, MATCH($B23, Ingredients_DB!$B$2:$B$501,0)),\"\"))","v":"Weight"},{"$f":"IF($B23=\"\",\"\",IFERROR(INDEX(Ingredients_DB!$I$2:$I$501, MATCH($B23, Ingredients_DB!$B$2:$B$501,0)),\"\"))","v":"g"},{"$f":"IF($B23=\"\",\"\",IFERROR(VLOOKUP($O23&\"|\"&$D23,UOM_Conversions!$A$2:$E$50,4,FALSE),\"CHECK UNIT\"))","v":1},{"$f":"IF($B23=\"\",\"\",IFERROR(INDEX(Ingredients_DB!$M$2:$M$501, MATCH($B23, Ingredients_DB!$B$2:$B$501,0)),0))","v":1},{"$f":"IF($B23=\"\",\"\",IFERROR(INDEX(Ingredients_DB!$N$2:$N$501, MATCH($B23, Ingredients_DB!$B$2:$B$501,0)),0))","v":0},{"$f":"IF($B23=\"\",\"\",IFERROR(INDEX(Ingredients_DB!$O$2:$O$501, MATCH($B23, Ingredients_DB!$B$2:$B$501,0)),0))","v":0},{"$f":"IF($B23=\"\",\"\",IFERROR(INDEX(Ingredients_DB!$P$2:$P$501, MATCH($B23, Ingredients_DB!$B$2:$B$501,0)),0))","v":0},{"$f":"IF($B23=\"\",\"\",IFERROR(INDEX(Ingredients_DB!$Q$2:$Q$501, MATCH($B23, Ingredients_DB!$B$2:$B$501,0)),0))","v":0},{"$f":"IF($B23=\"\",\"\",IFERROR(INDEX(Ingredients_DB!$R$2:$R$501, MATCH($B23, Ingredients_DB!$B$2:$B$501,0)),0))","v":0},{"$f":"IF($B23=\"\",\"\",IFERROR(INDEX(Ingredients_DB!$S$2:$S$501, MATCH($B23, Ingredients_DB!$B$2:$B$501,0)),0))","v":0},{"$f":"IF($B23=\"\",\"\",IFERROR(INDEX(Ingredients_DB!$T$2:$T$501, MATCH($B23, Ingredients_DB!$B$2:$B$501,0)),0))","v":0},{"$f":"IF($B23=\"\",\"\",IFERROR(INDEX(Ingredients_DB!$U$2:$U$501, MATCH($B23, Ingredients_DB!$B$2:$B$501,0)),0))","v":0},{"$f":"IF($B23=\"\",\"\",IFERROR(INDEX(Ingredients_DB!$V$2:$V$501, MATCH($B23, Ingredients_DB!$B$2:$B$501,0)),0))","v":0},{"$f":"IF($B23=\"\",\"\",IFERROR(INDEX(Ingredients_DB!$W$2:$W$501, MATCH($B23, Ingredients_DB!$B$2:$B$501,0)),0))","v":0},{"$f":"IF($B23=\"\",\"\",IFERROR(INDEX(Ingredients_DB!$X$2:$X$501, MATCH($B23, Ingredients_DB!$B$2:$B$501,0)),0))","v":0},{"$f":"IF($B23=\"\",\"\",IFERROR(INDEX(Ingredients_DB!$Y$2:$Y$501, MATCH($B23, Ingredients_DB!$B$2:$B$501,0)),0))","v":0},{"$f":"IF($B23=\"\",\"\",IFERROR(INDEX(Ingredients_DB!$Z$2:$Z$501, MATCH($B23, Ingredients_DB!$B$2:$B$501,0)),0))","v":0}]
[4,"Lettuce",{"v":20,"d":"20.00"},"g",{"v":0.95,"d":"95%"},{"v":21.05263157894737,"d":"21.05"},{"$f":"IF($B24=\"\",\"\",IFERROR(INDEX(Ingredients_DB!$K$2:$K$501, MATCH($B24, Ingredients_DB!$B$2:$B$501,0)),0))","v":{"v":0.008,"d":"$0.01"}},{"v":0.16842105263157897,"d":"$0.17"},"Shredded",{"$nulls":5},{"$f":"IF($B24=\"\",\"\",IFERROR(INDEX(Ingredients_DB!$H$2:$H$501, MATCH($B24, Ingredients_DB!$B$2:$B$501,0)),\"\"))","v":"Weight"},{"$f":"IF($B24=\"\",\"\",IFERROR(INDEX(Ingredients_DB!$I$2:$I$501, MATCH($B24, Ingredients_DB!$B$2:$B$501,0)),\"\"))","v":"g"},{"$f":"IF($B24=\"\",\"\",IFERROR(VLOOKUP($O24&\"|\"&$D24,UOM_Conversions!$A$2:$E$50,4,FALSE),\"CHECK UNIT\"))","v":1},{"$f":"IF($B24=\"\",\"\",IFERROR(INDEX(Ingredients_DB!$M$2:$M$501, MATCH($B24, Ingredients_DB!$B$2:$B$501,0)),0))","v":0},{"$f":"IF($B24=\"\",\"\",IFERROR(INDEX(Ingredients_DB!$N$2:$N$501, MATCH($B24, Ingredients_DB!$B$2:$B$501,0)),0))","v":0},{"$f":"IF($B24=\"\",\"\",IFERROR(INDEX(Ingredients_DB!$O$2:$O$501, MATCH($B24, Ingredients_DB!$B$2:$B$501,0)),0))","v":0},{"$f":"IF($B24=\"\",\"\",IFERROR(INDEX(Ingredients_DB!$P$2:$P$501, MATCH($B24, Ingredients_DB!$B$2:$B$501,0)),0))","v":0},{"$f":"IF($B24=\"\",\"\",IFERROR(INDEX(Ingredients_DB!$Q$2:$Q$501, MATCH($B24, Ingredients_DB!$B$2:$B$501,0)),0))","v":0},{"$f":"IF($B24=\"\",\"\",IFERROR(INDEX(Ingredients_DB!$R$2:$R$501, MATCH($B24, Ingredients_DB!$B$2:$B$501,0)),0))","v":0},{"$f":"IF($B24=\"\",\"\",IFERROR(INDEX(Ingredients_DB!$S$2:$S$501, MATCH($B24, Ingredients_DB!$B$2:$B$501,0)),0))","v":0},{"$f":"IF($B24=\"\",\"\",IFERROR(INDEX(Ingredients_DB!$T$2:$T$501, MATCH($B24, Ingredients_DB!$B$2:$B$501,0)),0))","v":0},{"$f":"IF($B24=\"\",\"\",IFERROR(INDEX(Ingredients_DB!$U$2:$U$501, MATCH($B24, Ingredients_DB!$B$2:$B$501,0)),0))","v":0},{"$f":"IF($B24=\"\",\"\",IFERROR(INDEX(Ingredients_DB!$V$2:$V$501, MATCH($B24, Ingredients_DB!$B$2:$B$501,0)),0))","v":0},{"$f":"IF($B24=\"\",\"\",IFERROR(INDEX(Ingredients_DB!$W$2:$W$501, MATCH($B24, Ingredients_DB!$B$2:$B$501,0)),0))","v":0},{"$f":"IF($B24=\"\",\"\",IFERROR(INDEX(Ingredients_DB!$X$2:$X$501, MATCH($B24, Ingredients_DB!$B$2:$B$501,0)),0))","v":0},{"$f":"IF($B24=\"\",\"\",IFERROR(INDEX(Ingredients_DB!$Y$2:$Y$501, MATCH($B24, Ingredients_DB!$B$2:$B$501,0)),0))","v":0},{"$f":"IF($B24=\"\",\"\",IFERROR(INDEX(Ingredients_DB!$Z$2:$Z$501, MATCH($B24, Ingredients_DB!$B$2:$B$501,0)),0))","v":0}]
[5,"Ketchup",{"v":20,"d":"20.00"},"g",{"v":1,"d":"100%"},{"v":20,"d":"20.00"},{"$f":"IF($B25=\"\",\"\",IFERROR(INDEX(Ingredients_DB!$K$2:$K$501, MATCH($B25, Ingredients_DB!$B$2:$B$501,0)),0))","v":{"v":0.004,"d":"$0.00"}},{"v":0.08,"d":"$0.08"},{"$nulls":6},{"$f":"IF($B25=\"\",\"\",IFERROR(INDEX(Ingredients_DB!$H$2:$H$501, MATCH($B25, Ingredients_DB!$B$2:$B$501,0)),\"\"))","v":"Weight"},{"$f":"IF($B25=\"\",\"\",IFERROR(INDEX(Ingredients_DB!$I$2:$I$501, MATCH($B25, Ingredients_DB!$B$2:$B$501,0)),\"\"))","v":"g"},{"$f":"IF($B25=\"\",\"\",IFERROR(VLOOKUP($O25&\"|\"&$D25,UOM_Conversions!$A$2:$E$50,4,FALSE),\"CHECK UNIT\"))","v":1},{"$f":"IF($B25=\"\",\"\",IFERROR(INDEX(Ingredients_DB!$M$2:$M$501, MATCH($B25, Ingredients_DB!$B$2:$B$501,0)),0))","v":0},{"$f":"IF($B25=\"\",\"\",IFERROR(INDEX(Ingredients_DB!$N$2:$N$501, MATCH($B25, Ingredients_DB!$B$2:$B$501,0)),0))","v":0},{"$f":"IF($B25=\"\",\"\",IFERROR(INDEX(Ingredients_DB!$O$2:$O$501, MATCH($B25, Ingredients_DB!$B$2:$B$501,0)),0))","v":0},{"$f":"IF($B25=\"\",\"\",IFERROR(INDEX(Ingredients_DB!$P$2:$P$501, MATCH($B25, Ingredients_DB!$B$2:$B$501,0)),0))","v":0},{"$f":"IF($B25=\"\",\"\",IFERROR(INDEX(Ingredients_DB!$Q$2:$Q$501, MATCH($B25, Ingredients_DB!$B$2:$B$501,0)),0))","v":0},{"$f":"IF($B25=\"\",\"\",IFERROR(INDEX(Ingredients_DB!$R$2:$R$501, MATCH($B25, Ingredients_DB!$B$2:$B$501,0)),0))","v":0},{"$f":"IF($B25=\"\",\"\",IFERROR(INDEX(Ingredients_DB!$S$2:$S$501, MATCH($B25, Ingredients_DB!$B$2:$B$501,0)),0))","v":0},{"$f":"IF($B25=\"\",\"\",IFERROR(INDEX(Ingredients_DB!$T$2:$T$501, MATCH($B25, Ingredients_DB!$B$2:$B$501,0)),0))","v":0},{"$f":"IF($B25=\"\",\"\",IFERROR(INDEX(Ingredients_DB!$U$2:$U$501, MATCH($B25, Ingredients_DB!$B$2:$B$501,0)),0))","v":0},{"$f":"IF($B25=\"\",\"\",IFERROR(INDEX(Ingredients_DB!$V$2:$V$501, MATCH($B25, Ingredients_DB!$B$2:$B$501,0)),0))","v":0},{"$f":"IF($B25=\"\",\"\",IFERROR(INDEX(Ingredients_DB!$W$2:$W$501, MATCH($B25, Ingredients_DB!$B$2:$B$501,0)),0))","v":0},{"$f":"IF($B25=\"\",\"\",IFERROR(INDEX(Ingredients_DB!$X$2:$X$501, MATCH($B25, Ingredients_DB!$B$2:$B$501,0)),0))","v":0},{"$f":"IF($B25=\"\",\"\",IFERROR(INDEX(Ingredients_DB!$Y$2:$Y$501, MATCH($B25, Ingredients_DB!$B$2:$B$501,0)),0))","v":0},{"$f":"IF($B25=\"\",\"\",IFERROR(INDEX(Ingredients_DB!$Z$2:$Z$501, MATCH($B25, Ingredients_DB!$B$2:$B$501,0)),0))","v":0}]
[6,"Mayonnaise",{"v":15,"d":"15.00"},"g",{"v":1,"d":"100%"},{"v":15,"d":"15.00"},{"$f":"IF($B26=\"\",\"\",IFERROR(INDEX(Ingredients_DB!$K$2:$K$501, MATCH($B26, Ingredients_DB!$B$2:$B$501,0)),0))","v":{"v":0.0075,"d":"$0.01"}},{"v":0.11249999999999999,"d":"$0.11"},{"$nulls":6},{"$f":"IF($B26=\"\",\"\",IFERROR(INDEX(Ingredients_DB!$H$2:$H$501, MATCH($B26, Ingredients_DB!$B$2:$B$501,0)),\"\"))","v":"Weight"},{"$f":"IF($B26=\"\",\"\",IFERROR(INDEX(Ingredients_DB!$I$2:$I$501, MATCH($B26, Ingredients_DB!$B$2:$B$501,0)),\"\"))","v":"g"},{"$f":"IF($B26=\"\",\"\",IFERROR(VLOOKUP($O26&\"|\"&$D26,UOM_Conversions!$A$2:$E$50,4,FALSE),\"CHECK UNIT\"))","v":1},{"$f":"IF($B26=\"\",\"\",IFERROR(INDEX(Ingredients_DB!$M$2:$M$501, MATCH($B26, Ingredients_DB!$B$2:$B$501,0)),0))","v":0},{"$f":"IF($B26=\"\",\"\",IFERROR(INDEX(Ingredients_DB!$N$2:$N$501, MATCH($B26, Ingredients_DB!$B$2:$B$501,0)),0))","v":1},{"$f":"IF($B26=\"\",\"\",IFERROR(INDEX(Ingredients_DB!$O$2:$O$501, MATCH($B26, Ingredients_DB!$B$2:$B$501,0)),0))","v":0},{"$f":"IF($B26=\"\",\"\",IFERROR(INDEX(Ingredients_DB!$P$2:$P$501, MATCH($B26, Ingredients_DB!$B$2:$B$501,0)),0))","v":0},{"$f":"IF($B26=\"\",\"\",IFERROR(INDEX(Ingredients_DB!$Q$2:$Q$501, MATCH($B26, Ingredients_DB!$B$2:$B$501,0)),0))","v":0},{"$f":"IF($B26=\"\",\"\",IFERROR(INDEX(Ingredients_DB!$R$2:$R$501, MATCH($B26, Ingredients_DB!$B$2:$B$501,0)),0))","v":0},{"$f":"IF($B26=\"\",\"\",IFERROR(INDEX(Ingredients_DB!$S$2:$S$501, MATCH($B26, Ingredients_DB!$B$2:$B$501,0)),0))","v":0},{"$f":"IF($B26=\"\",\"\",IFERROR(INDEX(Ingredients_DB!$T$2:$T$501, MATCH($B26, Ingredients_DB!$B$2:$B$501,0)),0))","v":0},{"$f":"IF($B26=\"\",\"\",IFERROR(INDEX(Ingredients_DB!$U$2:$U$501, MATCH($B26, Ingredients_DB!$B$2:$B$501,0)),0))","v":1},{"$f":"IF($B26=\"\",\"\",IFERROR(INDEX(Ingredients_DB!$V$2:$V$501, MATCH($B26, Ingredients_DB!$B$2:$B$501,0)),0))","v":0},{"$f":"IF($B26=\"\",\"\",IFERROR(INDEX(Ingredients_DB!$W$2:$W$501, MATCH($B26, Ingredients_DB!$B$2:$B$501,0)),0))","v":0},{"$f":"IF($B26=\"\",\"\",IFERROR(INDEX(Ingredients_DB!$X$2:$X$501, MATCH($B26, Ingredients_DB!$B$2:$B$501,0)),0))","v":0},{"$f":"IF($B26=\"\",\"\",IFERROR(INDEX(Ingredients_DB!$Y$2:$Y$501, MATCH($B26, Ingredients_DB!$B$2:$B$501,0)),0))","v":0},{"$f":"IF($B26=\"\",\"\",IFERROR(INDEX(Ingredients_DB!$Z$2:$Z$501, MATCH($B26, Ingredients_DB!$B$2:$B$501,0)),0))","v":0}]
[7,"French fries (frozen)",{"v":200,"d":"200.00"},"g",{"v":1,"d":"100%"},{"v":200,"d":"200.00"},{"$f":"IF($B27=\"\",\"\",IFERROR(INDEX(Ingredients_DB!$K$2:$K$501, MATCH($B27, Ingredients_DB!$B$2:$B$501,0)),0))","v":{"v":2.8E-3,"d":"$0.00"}},{"v":0.5599999999999999,"d":"$0.56"},"Portion",{"$nulls":5},{"$f":"IF($B27=\"\",\"\",IFERROR(INDEX(Ingredients_DB!$H$2:$H$501, MATCH($B27, Ingredients_DB!$B$2:$B$501,0)),\"\"))","v":"Weight"},{"$f":"IF($B27=\"\",\"\",IFERROR(INDEX(Ingredients_DB!$I$2:$I$501, MATCH($B27, Ingredients_DB!$B$2:$B$501,0)),\"\"))","v":"g"},{"$f":"IF($B27=\"\",\"\",IFERROR(VLOOKUP($O27&\"|\"&$D27,UOM_Conversions!$A$2:$E$50,4,FALSE),\"CHECK UNIT\"))","v":1},{"$f":"IF($B27=\"\",\"\",IFERROR(INDEX(Ingredients_DB!$M$2:$M$501, MATCH($B27, Ingredients_DB!$B$2:$B$501,0)),0))","v":0},{"$f":"IF($B27=\"\",\"\",IFERROR(INDEX(Ingredients_DB!$N$2:$N$501, MATCH($B27, Ingredients_DB!$B$2:$B$501,0)),0))","v":0},{"$f":"IF($B27=\"\",\"\",IFERROR(INDEX(Ingredients_DB!$O$2:$O$501, MATCH($B27, Ingredients_DB!$B$2:$B$501,0)),0))","v":0},{"$f":"IF($B27=\"\",\"\",IFERROR(INDEX(Ingredients_DB!$P$2:$P$501, MATCH($B27, Ingredients_DB!$B$2:$B$501,0)),0))","v":0},{"$f":"IF($B27=\"\",\"\",IFERROR(INDEX(Ingredients_DB!$Q$2:$Q$501, MATCH($B27, Ingredients_DB!$B$2:$B$501,0)),0))","v":0},{"$f":"IF($B27=\"\",\"\",IFERROR(INDEX(Ingredients_DB!$R$2:$R$501, MATCH($B27, Ingredients_DB!$B$2:$B$501,0)),0))","v":0},{"$f":"IF($B27=\"\",\"\",IFERROR(INDEX(Ingredients_DB!$S$2:$S$501, MATCH($B27, Ingredients_DB!$B$2:$B$501,0)),0))","v":0},{"$f":"IF($B27=\"\",\"\",IFERROR(INDEX(Ingredients_DB!$T$2:$T$501, MATCH($B27, Ingredients_DB!$B$2:$B$501,0)),0))","v":0},{"$f":"IF($B27=\"\",\"\",IFERROR(INDEX(Ingredients_DB!$U$2:$U$501, MATCH($B27, Ingredients_DB!$B$2:$B$501,0)),0))","v":0},{"$f":"IF($B27=\"\",\"\",IFERROR(INDEX(Ingredients_DB!$V$2:$V$501, MATCH($B27, Ingredients_DB!$B$2:$B$501,0)),0))","v":0},{"$f":"IF($B27=\"\",\"\",IFERROR(INDEX(Ingredients_DB!$W$2:$W$501, MATCH($B27, Ingredients_DB!$B$2:$B$501,0)),0))","v":0},{"$f":"IF($B27=\"\",\"\",IFERROR(INDEX(Ingredients_DB!$X$2:$X$501, MATCH($B27, Ingredients_DB!$B$2:$B$501,0)),0))","v":0},{"$f":"IF($B27=\"\",\"\",IFERROR(INDEX(Ingredients_DB!$Y$2:$Y$501, MATCH($B27, Ingredients_DB!$B$2:$B$501,0)),0))","v":0},{"$f":"IF($B27=\"\",\"\",IFERROR(INDEX(Ingredients_DB!$Z$2:$Z$501, MATCH($B27, Ingredients_DB!$B$2:$B$501,0)),0))","v":0}]
[8,"Sesame seeds",{"v":2,"d":"2.00"},"g",{"v":1,"d":"100%"},{"v":2,"d":"2.00"},{"$f":"IF($B28=\"\",\"\",IFERROR(INDEX(Ingredients_DB!$K$2:$K$501, MATCH($B28, Ingredients_DB!$B$2:$B$501,0)),0))","v":{"v":0.01,"d":"$0.01"}},{"v":0.02,"d":"$0.02"},"Bun topping (optional)",{"$nulls":5},{"$f":"IF($B28=\"\",\"\",IFERROR(INDEX(Ingredients_DB!$H$2:$H$501, MATCH($B28, Ingredients_DB!$B$2:$B$501,0)),\"\"))","v":"Weight"},{"$f":"IF($B28=\"\",\"\",IFERROR(INDEX(Ingredients_DB!$I$2:$I$501, MATCH($B28, Ingredients_DB!$B$2:$B$501,0)),\"\"))","v":"g"},{"$f":"IF($B28=\"\",\"\",IFERROR(VLOOKUP($O28&\"|\"&$D28,UOM_Conversions!$A$2:$E$50,4,FALSE),\"CHECK UNIT\"))","v":1},{"$f":"IF($B28=\"\",\"\",IFERROR(INDEX(Ingredients_DB!$M$2:$M$501, MATCH($B28, Ingredients_DB!$B$2:$B$501,0)),0))","v":0},{"$f":"IF($B28=\"\",\"\",IFERROR(INDEX(Ingredients_DB!$N$2:$N$501, MATCH($B28, Ingredients_DB!$B$2:$B$501,0)),0))","v":0},{"$f":"IF($B28=\"\",\"\",IFERROR(INDEX(Ingredients_DB!$O$2:$O$501, MATCH($B28, Ingredients_DB!$B$2:$B$501,0)),0))","v":0},{"$f":"IF($B28=\"\",\"\",IFERROR(INDEX(Ingredients_DB!$P$2:$P$501, MATCH($B28, Ingredients_DB!$B$2:$B$501,0)),0))","v":0},{"$f":"IF($B28=\"\",\"\",IFERROR(INDEX(Ingredients_DB!$Q$2:$Q$501, MATCH($B28, Ingredients_DB!$B$2:$B$501,0)),0))","v":0},{"$f":"IF($B28=\"\",\"\",IFERROR(INDEX(Ingredients_DB!$R$2:$R$501, MATCH($B28, Ingredients_DB!$B$2:$B$501,0)),0))","v":0},{"$f":"IF($B28=\"\",\"\",IFERROR(INDEX(Ingredients_DB!$S$2:$S$501, MATCH($B28, Ingredients_DB!$B$2:$B$501,0)),0))","v":0},{"$f":"IF($B28=\"\",\"\",IFERROR(INDEX(Ingredients_DB!$T$2:$T$501, MATCH($B28, Ingredients_DB!$B$2:$B$501,0)),0))","v":0},{"$f":"IF($B28=\"\",\"\",IFERROR(INDEX(Ingredients_DB!$U$2:$U$501, MATCH($B28, Ingredients_DB!$B$2:$B$501,0)),0))","v":0},{"$f":"IF($B28=\"\",\"\",IFERROR(INDEX(Ingredients_DB!$V$2:$V$501, MATCH($B28, Ingredients_DB!$B$2:$B$501,0)),0))","v":1},{"$f":"IF($B28=\"\",\"\",IFERROR(INDEX(Ingredients_DB!$W$2:$W$501, MATCH($B28, Ingredients_DB!$B$2:$B$501,0)),0))","v":0},{"$f":"IF($B28=\"\",\"\",IFERROR(INDEX(Ingredients_DB!$X$2:$X$501, MATCH($B28, Ingredients_DB!$B$2:$B$501,0)),0))","v":0},{"$f":"IF($B28=\"\",\"\",IFERROR(INDEX(Ingredients_DB!$Y$2:$Y$501, MATCH($B28, Ingredients_DB!$B$2:$B$501,0)),0))","v":0},{"$f":"IF($B28=\"\",\"\",IFERROR(INDEX(Ingredients_DB!$Z$2:$Z$501, MATCH($B28, Ingredients_DB!$B$2:$B$501,0)),0))","v":0}]
[9,null,{"v":0,"d":"0.00"},"g",null,"",{"$f":"IF($B29=\"\",\"\",IFERROR(INDEX(Ingredients_DB!$K$2:$K$501, MATCH($B29, Ingredients_DB!$B$2:$B$501,0)),0))","v":""},"",{"$nulls":6},{"$f":"IF($B29=\"\",\"\",IFERROR(INDEX(Ingredients_DB!$H$2:$H$501, MATCH($B29, Ingredients_DB!$B$2:$B$501,0)),\"\"))","v":""},{"$f":"IF($B29=\"\",\"\",IFERROR(INDEX(Ingredients_DB!$I$2:$I$501, MATCH($B29, Ingredients_DB!$B$2:$B$501,0)),\"\"))","v":""},{"$f":"IF($B29=\"\",\"\",IFERROR(VLOOKUP($O29&\"|\"&$D29,UOM_Conversions!$A$2:$E$50,4,FALSE),\"CHECK UNIT\"))","v":""},{"$f":"IF($B29=\"\",\"\",IFERROR(INDEX(Ingredients_DB!$M$2:$M$501, MATCH($B29, Ingredients_DB!$B$2:$B$501,0)),0))","v":""},{"$f":"IF($B29=\"\",\"\",IFERROR(INDEX(Ingredients_DB!$N$2:$N$501, MATCH($B29, Ingredients_DB!$B$2:$B$501,0)),0))","v":""},{"$f":"IF($B29=\"\",\"\",IFERROR(INDEX(Ingredients_DB!$O$2:$O$501, MATCH($B29, Ingredients_DB!$B$2:$B$501,0)),0))","v":""},{"$f":"IF($B29=\"\",\"\",IFERROR(INDEX(Ingredients_DB!$P$2:$P$501, MATCH($B29, Ingredients_DB!$B$2:$B$501,0)),0))","v":""},{"$f":"IF($B29=\"\",\"\",IFERROR(INDEX(Ingredients_DB!$Q$2:$Q$501, MATCH($B29, Ingredients_DB!$B$2:$B$501,0)),0))","v":""},{"$f":"IF($B29=\"\",\"\",IFERROR(INDEX(Ingredients_DB!$R$2:$R$501, MATCH($B29, Ingredients_DB!$B$2:$B$501,0)),0))","v":""},{"$f":"IF($B29=\"\",\"\",IFERROR(INDEX(Ingredients_DB!$S$2:$S$501, MATCH($B29, Ingredients_DB!$B$2:$B$501,0)),0))","v":""},{"$f":"IF($B29=\"\",\"\",IFERROR(INDEX(Ingredients_DB!$T$2:$T$501, MATCH($B29, Ingredients_DB!$B$2:$B$501,0)),0))","v":""},{"$f":"IF($B29=\"\",\"\",IFERROR(INDEX(Ingredients_DB!$U$2:$U$501, MATCH($B29, Ingredients_DB!$B$2:$B$501,0)),0))","v":""},{"$f":"IF($B29=\"\",\"\",IFERROR(INDEX(Ingredients_DB!$V$2:$V$501, MATCH($B29, Ingredients_DB!$B$2:$B$501,0)),0))","v":""},{"$f":"IF($B29=\"\",\"\",IFERROR(INDEX(Ingredients_DB!$W$2:$W$501, MATCH($B29, Ingredients_DB!$B$2:$B$501,0)),0))","v":""},{"$f":"IF($B29=\"\",\"\",IFERROR(INDEX(Ingredients_DB!$X$2:$X$501, MATCH($B29, Ingredients_DB!$B$2:$B$501,0)),0))","v":""},{"$f":"IF($B29=\"\",\"\",IFERROR(INDEX(Ingredients_DB!$Y$2:$Y$501, MATCH($B29, Ingredients_DB!$B$2:$B$501,0)),0))","v":""},{"$f":"IF($B29=\"\",\"\",IFERROR(INDEX(Ingredients_DB!$Z$2:$Z$501, MATCH($B29, Ingredients_DB!$B$2:$B$501,0)),0))","v":""}]
[10,null,{"v":0,"d":"0.00"},"g",null,"",{"$f":"IF($B30=\"\",\"\",IFERROR(INDEX(Ingredients_DB!$K$2:$K$501, MATCH($B30, Ingredients_DB!$B$2:$B$501,0)),0))","v":""},"",{"$nulls":6},{"$f":"IF($B30=\"\",\"\",IFERROR(INDEX(Ingredients_DB!$H$2:$H$501, MATCH($B30, Ingredients_DB!$B$2:$B$501,0)),\"\"))","v":""},{"$f":"IF($B30=\"\",\"\",IFERROR(INDEX(Ingredients_DB!$I$2:$I$501, MATCH($B30, Ingredients_DB!$B$2:$B$501,0)),\"\"))","v":""},{"$f":"IF($B30=\"\",\"\",IFERROR(VLOOKUP($O30&\"|\"&$D30,UOM_Conversions!$A$2:$E$50,4,FALSE),\"CHECK UNIT\"))","v":""},{"$f":"IF($B30=\"\",\"\",IFERROR(INDEX(Ingredients_DB!$M$2:$M$501, MATCH($B30, Ingredients_DB!$B$2:$B$501,0)),0))","v":""},{"$f":"IF($B30=\"\",\"\",IFERROR(INDEX(Ingredients_DB!$N$2:$N$501, MATCH($B30, Ingredients_DB!$B$2:$B$501,0)),0))","v":""},{"$f":"IF($B30=\"\",\"\",IFERROR(INDEX(Ingredients_DB!$O$2:$O$501, MATCH($B30, Ingredients_DB!$B$2:$B$501,0)),0))","v":""},{"$f":"IF($B30=\"\",\"\",IFERROR(INDEX(Ingredients_DB!$P$2:$P$501, MATCH($B30, Ingredients_DB!$B$2:$B$501,0)),0))","v":""},{"$f":"IF($B30=\"\",\"\",IFERROR(INDEX(Ingredients_DB!$Q$2:$Q$501, MATCH($B30, Ingredients_DB!$B$2:$B$501,0)),0))","v":""},{"$f":"IF($B30=\"\",\"\",IFERROR(INDEX(Ingredients_DB!$R$2:$R$501, MATCH($B30, Ingredients_DB!$B$2:$B$501,0)),0))","v":""},{"$f":"IF($B30=\"\",\"\",IFERROR(INDEX(Ingredients_DB!$S$2:$S$501, MATCH($B30, Ingredients_DB!$B$2:$B$501,0)),0))","v":""},{"$f":"IF($B30=\"\",\"\",IFERROR(INDEX(Ingredients_DB!$T$2:$T$501, MATCH($B30, Ingredients_DB!$B$2:$B$501,0)),0))","v":""},{"$f":"IF($B30=\"\",\"\",IFERROR(INDEX(Ingredients_DB!$U$2:$U$501, MATCH($B30, Ingredients_DB!$B$2:$B$501,0)),0))","v":""},{"$f":"IF($B30=\"\",\"\",IFERROR(INDEX(Ingredients_DB!$V$2:$V$501, MATCH($B30, Ingredients_DB!$B$2:$B$501,0)),0))","v":""},{"$f":"IF($B30=\"\",\"\",IFERROR(INDEX(Ingredients_DB!$W$2:$W$501, MATCH($B30, Ingredients_DB!$B$2:$B$501,0)),0))","v":""},{"$f":"IF($B30=\"\",\"\",IFERROR(INDEX(Ingredients_DB!$X$2:$X$501, MATCH($B30, Ingredients_DB!$B$2:$B$501,0)),0))","v":""},{"$f":"IF($B30=\"\",\"\",IFERROR(INDEX(Ingredients_DB!$Y$2:$Y$501, MATCH($B30, Ingredients_DB!$B$2:$B$501,0)),0))","v":""},{"$f":"IF($B30=\"\",\"\",IFERROR(INDEX(Ingredients_DB!$Z$2:$Z$501, MATCH($B30, Ingredients_DB!$B$2:$B$501,0)),0))","v":""}]
[11,null,{"v":0,"d":"0.00"},"g",null,"",{"$f":"IF($B31=\"\",\"\",IFERROR(INDEX(Ingredients_DB!$K$2:$K$501, MATCH($B31, Ingredients_DB!$B$2:$B$501,0)),0))","v":""},"",{"$nulls":6},{"$f":"IF($B31=\"\",\"\",IFERROR(INDEX(Ingredients_DB!$H$2:$H$501, MATCH($B31, Ingredients_DB!$B$2:$B$501,0)),\"\"))","v":""},{"$f":"IF($B31=\"\",\"\",IFERROR(INDEX(Ingredients_DB!$I$2:$I$501, MATCH($B31, Ingredients_DB!$B$2:$B$501,0)),\"\"))","v":""},{"$f":"IF($B31=\"\",\"\",IFERROR(VLOOKUP($O31&\"|\"&$D31,UOM_Conversions!$A$2:$E$50,4,FALSE),\"CHECK UNIT\"))","v":""},{"$f":"IF($B31=\"\",\"\",IFERROR(INDEX(Ingredients_DB!$M$2:$M$501, MATCH($B31, Ingredients_DB!$B$2:$B$501,0)),0))","v":""},{"$f":"IF($B31=\"\",\"\",IFERROR(INDEX(Ingredients_DB!$N$2:$N$501, MATCH($B31, Ingredients_DB!$B$2:$B$501,0)),0))","v":""},{"$f":"IF($B31=\"\",\"\",IFERROR(INDEX(Ingredients_DB!$O$2:$O$501, MATCH($B31, Ingredients_DB!$B$2:$B$501,0)),0))","v":""},{"$f":"IF($B31=\"\",\"\",IFERROR(INDEX(Ingredients_DB!$P$2:$P$501, MATCH($B31, Ingredients_DB!$B$2:$B$501,0)),0))","v":""},{"$f":"IF($B31=\"\",\"\",IFERROR(INDEX(Ingredients_DB!$Q$2:$Q$501, MATCH($B31, Ingredients_DB!$B$2:$B$501,0)),0))","v":""},{"$f":"IF($B31=\"\",\"\",IFERROR(INDEX(Ingredients_DB!$R$2:$R$501, MATCH($B31, Ingredients_DB!$B$2:$B$501,0)),0))","v":""},{"$f":"IF($B31=\"\",\"\",IFERROR(INDEX(Ingredients_DB!$S$2:$S$501, MATCH($B31, Ingredients_DB!$B$2:$B$501,0)),0))","v":""},{"$f":"IF($B31=\"\",\"\",IFERROR(INDEX(Ingredients_DB!$T$2:$T$501, MATCH($B31, Ingredients_DB!$B$2:$B$501,0)),0))","v":""},{"$f":"IF($B31=\"\",\"\",IFERROR(INDEX(Ingredients_DB!$U$2:$U$501, MATCH($B31, Ingredients_DB!$B$2:$B$501,0)),0))","v":""},{"$f":"IF($B31=\"\",\"\",IFERROR(INDEX(Ingredients_DB!$V$2:$V$501, MATCH($B31, Ingredients_DB!$B$2:$B$501,0)),0))","v":""},{"$f":"IF($B31=\"\",\"\",IFERROR(INDEX(Ingredients_DB!$W$2:$W$501, MATCH($B31, Ingredients_DB!$B$2:$B$501,0)),0))","v":""},{"$f":"IF($B31=\"\",\"\",IFERROR(INDEX(Ingredients_DB!$X$2:$X$501, MATCH($B31, Ingredients_DB!$B$2:$B$501,0)),0))","v":""},{"$f":"IF($B31=\"\",\"\",IFERROR(INDEX(Ingredients_DB!$Y$2:$Y$501, MATCH($B31, Ingredients_DB!$B$2:$B$501,0)),0))","v":""},{"$f":"IF($B31=\"\",\"\",IFERROR(INDEX(Ingredients_DB!$Z$2:$Z$501, MATCH($B31, Ingredients_DB!$B$2:$B$501,0)),0))","v":""}]
[12,null,{"v":0,"d":"0.00"},"g",null,"",{"$f":"IF($B32=\"\",\"\",IFERROR(INDEX(Ingredients_DB!$K$2:$K$501, MATCH($B32, Ingredients_DB!$B$2:$B$501,0)),0))","v":""},"",{"$nulls":6},{"$f":"IF($B32=\"\",\"\",IFERROR(INDEX(Ingredients_DB!$H$2:$H$501, MATCH($B32, Ingredients_DB!$B$2:$B$501,0)),\"\"))","v":""},{"$f":"IF($B32=\"\",\"\",IFERROR(INDEX(Ingredients_DB!$I$2:$I$501, MATCH($B32, Ingredients_DB!$B$2:$B$501,0)),\"\"))","v":""},{"$f":"IF($B32=\"\",\"\",IFERROR(VLOOKUP($O32&\"|\"&$D32,UOM_Conversions!$A$2:$E$50,4,FALSE),\"CHECK UNIT\"))","v":""},{"$f":"IF($B32=\"\",\"\",IFERROR(INDEX(Ingredients_DB!$M$2:$M$501, MATCH($B32, Ingredients_DB!$B$2:$B$501,0)),0))","v":""},{"$f":"IF($B32=\"\",\"\",IFERROR(INDEX(Ingredients_DB!$N$2:$N$501, MATCH($B32, Ingredients_DB!$B$2:$B$501,0)),0))","v":""},{"$f":"IF($B32=\"\",\"\",IFERROR(INDEX(Ingredients_DB!$O$2:$O$501, MATCH($B32, Ingredients_DB!$B$2:$B$501,0)),0))","v":""},{"$f":"IF($B32=\"\",\"\",IFERROR(INDEX(Ingredients_DB!$P$2:$P$501, MATCH($B32, Ingredients_DB!$B$2:$B$501,0)),0))","v":""},{"$f":"IF($B32=\"\",\"\",IFERROR(INDEX(Ingredients_DB!$Q$2:$Q$501, MATCH($B32, Ingredients_DB!$B$2:$B$501,0)),0))","v":""},{"$f":"IF($B32=\"\",\"\",IFERROR(INDEX(Ingredients_DB!$R$2:$R$501, MATCH($B32, Ingredients_DB!$B$2:$B$501,0)),0))","v":""},{"$f":"IF($B32=\"\",\"\",IFERROR(INDEX(Ingredients_DB!$S$2:$S$501, MATCH($B32, Ingredients_DB!$B$2:$B$501,0)),0))","v":""},{"$f":"IF($B32=\"\",\"\",IFERROR(INDEX(Ingredients_DB!$T$2:$T$501, MATCH($B32, Ingredients_DB!$B$2:$B$501,0)),0))","v":""},{"$f":"IF($B32=\"\",\"\",IFERROR(INDEX(Ingredients_DB!$U$2:$U$501, MATCH($B32, Ingredients_DB!$B$2:$B$501,0)),0))","v":""},{"$f":"IF($B32=\"\",\"\",IFERROR(INDEX(Ingredients_DB!$V$2:$V$501, MATCH($B32, Ingredients_DB!$B$2:$B$501,0)),0))","v":""},{"$f":"IF($B32=\"\",\"\",IFERROR(INDEX(Ingredients_DB!$W$2:$W$501, MATCH($B32, Ingredients_DB!$B$2:$B$501,0)),0))","v":""},{"$f":"IF($B32=\"\",\"\",IFERROR(INDEX(Ingredients_DB!$X$2:$X$501, MATCH($B32, Ingredients_DB!$B$2:$B$501,0)),0))","v":""},{"$f":"IF($B32=\"\",\"\",IFERROR(INDEX(Ingredients_DB!$Y$2:$Y$501, MATCH($B32, Ingredients_DB!$B$2:$B$501,0)),0))","v":""},{"$f":"IF($B32=\"\",\"\",IFERROR(INDEX(Ingredients_DB!$Z$2:$Z$501, MATCH($B32, Ingredients_DB!$B$2:$B$501,0)),0))","v":""}]
[13,null,{"v":0,"d":"0.00"},"g",null,"",{"$f":"IF($B33=\"\",\"\",IFERROR(INDEX(Ingredients_DB!$K$2:$K$501, MATCH($B33, Ingredients_DB!$B$2:$B$501,0)),0))","v":""},"",{"$nulls":6},{"$f":"IF($B33=\"\",\"\",IFERROR(INDEX(Ingredients_DB!$H$2:$H$501, MATCH($B33, Ingredients_DB!$B$2:$B$501,0)),\"\"))","v":""},{"$f":"IF($B33=\"\",\"\",IFERROR(INDEX(Ingredients_DB!$I$2:$I$501, MATCH($B33, Ingredients_DB!$B$2:$B$501,0)),\"\"))","v":""},{"$f":"IF($B33=\"\",\"\",IFERROR(VLOOKUP($O33&\"|\"&$D33,UOM_Conversions!$A$2:$E$50,4,FALSE),\"CHECK UNIT\"))","v":""},{"$f":"IF($B33=\"\",\"\",IFERROR(INDEX(Ingredients_DB!$M$2:$M$501, MATCH($B33, Ingredients_DB!$B$2:$B$501,0)),0))","v":""},{"$f":"IF($B33=\"\",\"\",IFERROR(INDEX(Ingredients_DB!$N$2:$N$501, MATCH($B33, Ingredients_DB!$B$2:$B$501,0)),0))","v":""},{"$f":"IF($B33=\"\",\"\",IFERROR(INDEX(Ingredients_DB!$O$2:$O$501, MATCH($B33, Ingredients_DB!$B$2:$B$501,0)),0))","v":""},{"$f":"IF($B33=\"\",\"\",IFERROR(INDEX(Ingredients_DB!$P$2:$P$501, MATCH($B33, Ingredients_DB!$B$2:$B$501,0)),0))","v":""},{"$f":"IF($B33=\"\",\"\",IFERROR(INDEX(Ingredients_DB!$Q$2:$Q$501, MATCH($B33, Ingredients_DB!$B$2:$B$501,0)),0))","v":""},{"$f":"IF($B33=\"\",\"\",IFERROR(INDEX(Ingredients_DB!$R$2:$R$501, MATCH($B33, Ingredients_DB!$B$2:$B$501,0)),0))","v":""},{"$f":"IF($B33=\"\",\"\",IFERROR(INDEX(Ingredients_DB!$S$2:$S$501, MATCH($B33, Ingredients_DB!$B$2:$B$501,0)),0))","v":""},{"$f":"IF($B33=\"\",\"\",IFERROR(INDEX(Ingredients_DB!$T$2:$T$501, MATCH($B33, Ingredients_DB!$B$2:$B$501,0)),0))","v":""},{"$f":"IF($B33=\"\",\"\",IFERROR(INDEX(Ingredients_DB!$U$2:$U$501, MATCH($B33, Ingredients_DB!$B$2:$B$501,0)),0))","v":""},{"$f":"IF($B33=\"\",\"\",IFERROR(INDEX(Ingredients_DB!$V$2:$V$501, MATCH($B33, Ingredients_DB!$B$2:$B$501,0)),0))","v":""},{"$f":"IF($B33=\"\",\"\",IFERROR(INDEX(Ingredients_DB!$W$2:$W$501, MATCH($B33, Ingredients_DB!$B$2:$B$501,0)),0))","v":""},{"$f":"IF($B33=\"\",\"\",IFERROR(INDEX(Ingredients_DB!$X$2:$X$501, MATCH($B33, Ingredients_DB!$B$2:$B$501,0)),0))","v":""},{"$f":"IF($B33=\"\",\"\",IFERROR(INDEX(Ingredients_DB!$Y$2:$Y$501, MATCH($B33, Ingredients_DB!$B$2:$B$501,0)),0))","v":""},{"$f":"IF($B33=\"\",\"\",IFERROR(INDEX(Ingredients_DB!$Z$2:$Z$501, MATCH($B33, Ingredients_DB!$B$2:$B$501,0)),0))","v":""}]
[14,null,{"v":0,"d":"0.00"},"g",null,"",{"$f":"IF($B34=\"\",\"\",IFERROR(INDEX(Ingredients_DB!$K$2:$K$501, MATCH($B34, Ingredients_DB!$B$2:$B$501,0)),0))","v":""},"",{"$nulls":6},{"$f":"IF($B34=\"\",\"\",IFERROR(INDEX(Ingredients_DB!$H$2:$H$501, MATCH($B34, Ingredients_DB!$B$2:$B$501,0)),\"\"))","v":""},{"$f":"IF($B34=\"\",\"\",IFERROR(INDEX(Ingredients_DB!$I$2:$I$501, MATCH($B34, Ingredients_DB!$B$2:$B$501,0)),\"\"))","v":""},{"$f":"IF($B34=\"\",\"\",IFERROR(VLOOKUP($O34&\"|\"&$D34,UOM_Conversions!$A$2:$E$50,4,FALSE),\"CHECK UNIT\"))","v":""},{"$f":"IF($B34=\"\",\"\",IFERROR(INDEX(Ingredients_DB!$M$2:$M$501, MATCH($B34, Ingredients_DB!$B$2:$B$501,0)),0))","v":""},{"$f":"IF($B34=\"\",\"\",IFERROR(INDEX(Ingredients_DB!$N$2:$N$501, MATCH($B34, Ingredients_DB!$B$2:$B$501,0)),0))","v":""},{"$f":"IF($B34=\"\",\"\",IFERROR(INDEX(Ingredients_DB!$O$2:$O$501, MATCH($B34, Ingredients_DB!$B$2:$B$501,0)),0))","v":""},{"$f":"IF($B34=\"\",\"\",IFERROR(INDEX(Ingredients_DB!$P$2:$P$501, MATCH($B34, Ingredients_DB!$B$2:$B$501,0)),0))","v":""},{"$f":"IF($B34=\"\",\"\",IFERROR(INDEX(Ingredients_DB!$Q$2:$Q$501, MATCH($B34, Ingredients_DB!$B$2:$B$501,0)),0))","v":""},{"$f":"IF($B34=\"\",\"\",IFERROR(INDEX(Ingredients_DB!$R$2:$R$501, MATCH($B34, Ingredients_DB!$B$2:$B$501,0)),0))","v":""},{"$f":"IF($B34=\"\",\"\",IFERROR(INDEX(Ingredients_DB!$S$2:$S$501, MATCH($B34, Ingredients_DB!$B$2:$B$501,0)),0))","v":""},{"$f":"IF($B34=\"\",\"\",IFERROR(INDEX(Ingredients_DB!$T$2:$T$501, MATCH($B34, Ingredients_DB!$B$2:$B$501,0)),0))","v":""},{"$f":"IF($B34=\"\",\"\",IFERROR(INDEX(Ingredients_DB!$U$2:$U$501, MATCH($B34, Ingredients_DB!$B$2:$B$501,0)),0))","v":""},{"$f":"IF($B34=\"\",\"\",IFERROR(INDEX(Ingredients_DB!$V$2:$V$501, MATCH($B34, Ingredients_DB!$B$2:$B$501,0)),0))","v":""},{"$f":"IF($B34=\"\",\"\",IFERROR(INDEX(Ingredients_DB!$W$2:$W$501, MATCH($B34, Ingredients_DB!$B$2:$B$501,0)),0))","v":""},{"$f":"IF($B34=\"\",\"\",IFERROR(INDEX(Ingredients_DB!$X$2:$X$501, MATCH($B34, Ingredients_DB!$B$2:$B$501,0)),0))","v":""},{"$f":"IF($B34=\"\",\"\",IFERROR(INDEX(Ingredients_DB!$Y$2:$Y$501, MATCH($B34, Ingredients_DB!$B$2:$B$501,0)),0))","v":""},{"$f":"IF($B34=\"\",\"\",IFERROR(INDEX(Ingredients_DB!$Z$2:$Z$501, MATCH($B34, Ingredients_DB!$B$2:$B$501,0)),0))","v":""}]
[15,null,{"v":0,"d":"0.00"},"g",null,"",{"$f":"IF($B35=\"\",\"\",IFERROR(INDEX(Ingredients_DB!$K$2:$K$501, MATCH($B35, Ingredients_DB!$B$2:$B$501,0)),0))","v":""},"",{"$nulls":6},{"$f":"IF($B35=\"\",\"\",IFERROR(INDEX(Ingredients_DB!$H$2:$H$501, MATCH($B35, Ingredients_DB!$B$2:$B$501,0)),\"\"))","v":""},{"$f":"IF($B35=\"\",\"\",IFERROR(INDEX(Ingredients_DB!$I$2:$I$501, MATCH($B35, Ingredients_DB!$B$2:$B$501,0)),\"\"))","v":""},{"$f":"IF($B35=\"\",\"\",IFERROR(VLOOKUP($O35&\"|\"&$D35,UOM_Conversions!$A$2:$E$50,4,FALSE),\"CHECK UNIT\"))","v":""},{"$f":"IF($B35=\"\",\"\",IFERROR(INDEX(Ingredients_DB!$M$2:$M$501, MATCH($B35, Ingredients_DB!$B$2:$B$501,0)),0))","v":""},{"$f":"IF($B35=\"\",\"\",IFERROR(INDEX(Ingredients_DB!$N$2:$N$501, MATCH($B35, Ingredients_DB!$B$2:$B$501,0)),0))","v":""},{"$f":"IF($B35=\"\",\"\",IFERROR(INDEX(Ingredients_DB!$O$2:$O$501, MATCH($B35, Ingredients_DB!$B$2:$B$501,0)),0))","v":""},{"$f":"IF($B35=\"\",\"\",IFERROR(INDEX(Ingredients_DB!$P$2:$P$501, MATCH($B35, Ingredients_DB!$B$2:$B$501,0)),0))","v":""},{"$f":"IF($B35=\"\",\"\",IFERROR(INDEX(Ingredients_DB!$Q$2:$Q$501, MATCH($B35, Ingredients_DB!$B$2:$B$501,0)),0))","v":""},{"$f":"IF($B35=\"\",\"\",IFERROR(INDEX(Ingredients_DB!$R$2:$R$501, MATCH($B35, Ingredients_DB!$B$2:$B$501,0)),0))","v":""},{"$f":"IF($B35=\"\",\"\",IFERROR(INDEX(Ingredients_DB!$S$2:$S$501, MATCH($B35, Ingredients_DB!$B$2:$B$501,0)),0))","v":""},{"$f":"IF($B35=\"\",\"\",IFERROR(INDEX(Ingredients_DB!$T$2:$T$501, MATCH($B35, Ingredients_DB!$B$2:$B$501,0)),0))","v":""},{"$f":"IF($B35=\"\",\"\",IFERROR(INDEX(Ingredients_DB!$U$2:$U$501, MATCH($B35, Ingredients_DB!$B$2:$B$501,0)),0))","v":""},{"$f":"IF($B35=\"\",\"\",IFERROR(INDEX(Ingredients_DB!$V$2:$V$501, MATCH($B35, Ingredients_DB!$B$2:$B$501,0)),0))","v":""},{"$f":"IF($B35=\"\",\"\",IFERROR(INDEX(Ingredients_DB!$W$2:$W$501, MATCH($B35, Ingredients_DB!$B$2:$B$501,0)),0))","v":""},{"$f":"IF($B35=\"\",\"\",IFERROR(INDEX(Ingredients_DB!$X$2:$X$501, MATCH($B35, Ingredients_DB!$B$2:$B$501,0)),0))","v":""},{"$f":"IF($B35=\"\",\"\",IFERROR(INDEX(Ingredients_DB!$Y$2:$Y$501, MATCH($B35, Ingredients_DB!$B$2:$B$501,0)),0))","v":""},{"$f":"IF($B35=\"\",\"\",IFERROR(INDEX(Ingredients_DB!$Z$2:$Z$501, MATCH($B35, Ingredients_DB!$B$2:$B$501,0)),0))","v":""}]
[16,null,{"v":0,"d":"0.00"},"g",null,"",{"$f":"IF($B36=\"\",\"\",IFERROR(INDEX(Ingredients_DB!$K$2:$K$501, MATCH($B36, Ingredients_DB!$B$2:$B$501,0)),0))","v":""},"",{"$nulls":6},{"$f":"IF($B36=\"\",\"\",IFERROR(INDEX(Ingredients_DB!$H$2:$H$501, MATCH($B36, Ingredients_DB!$B$2:$B$501,0)),\"\"))","v":""},{"$f":"IF($B36=\"\",\"\",IFERROR(INDEX(Ingredients_DB!$I$2:$I$501, MATCH($B36, Ingredients_DB!$B$2:$B$501,0)),\"\"))","v":""},{"$f":"IF($B36=\"\",\"\",IFERROR(VLOOKUP($O36&\"|\"&$D36,UOM_Conversions!$A$2:$E$50,4,FALSE),\"CHECK UNIT\"))","v":""},{"$f":"IF($B36=\"\",\"\",IFERROR(INDEX(Ingredients_DB!$M$2:$M$501, MATCH($B36, Ingredients_DB!$B$2:$B$501,0)),0))","v":""},{"$f":"IF($B36=\"\",\"\",IFERROR(INDEX(Ingredients_DB!$N$2:$N$501, MATCH($B36, Ingredients_DB!$B$2:$B$501,0)),0))","v":""},{"$f":"IF($B36=\"\",\"\",IFERROR(INDEX(Ingredients_DB!$O$2:$O$501, MATCH($B36, Ingredients_DB!$B$2:$B$501,0)),0))","v":""},{"$f":"IF($B36=\"\",\"\",IFERROR(INDEX(Ingredients_DB!$P$2:$P$501, MATCH($B36, Ingredients_DB!$B$2:$B$501,0)),0))","v":""},{"$f":"IF($B36=\"\",\"\",IFERROR(INDEX(Ingredients_DB!$Q$2:$Q$501, MATCH($B36, Ingredients_DB!$B$2:$B$501,0)),0))","v":""},{"$f":"IF($B36=\"\",\"\",IFERROR(INDEX(Ingredients_DB!$R$2:$R$501, MATCH($B36, Ingredients_DB!$B$2:$B$501,0)),0))","v":""},{"$f":"IF($B36=\"\",\"\",IFERROR(INDEX(Ingredients_DB!$S$2:$S$501, MATCH($B36, Ingredients_DB!$B$2:$B$501,0)),0))","v":""},{"$f":"IF($B36=\"\",\"\",IFERROR(INDEX(Ingredients_DB!$T$2:$T$501, MATCH($B36, Ingredients_DB!$B$2:$B$501,0)),0))","v":""},{"$f":"IF($B36=\"\",\"\",IFERROR(INDEX(Ingredients_DB!$U$2:$U$501, MATCH($B36, Ingredients_DB!$B$2:$B$501,0)),0))","v":""},{"$f":"IF($B36=\"\",\"\",IFERROR(INDEX(Ingredients_DB!$V$2:$V$501, MATCH($B36, Ingredients_DB!$B$2:$B$501,0)),0))","v":""},{"$f":"IF($B36=\"\",\"\",IFERROR(INDEX(Ingredients_DB!$W$2:$W$501, MATCH($B36, Ingredients_DB!$B$2:$B$501,0)),0))","v":""},{"$f":"IF($B36=\"\",\"\",IFERROR(INDEX(Ingredients_DB!$X$2:$X$501, MATCH($B36, Ingredients_DB!$B$2:$B$501,0)),0))","v":""},{"$f":"IF($B36=\"\",\"\",IFERROR(INDEX(Ingredients_DB!$Y$2:$Y$501, MATCH($B36, Ingredients_DB!$B$2:$B$501,0)),0))","v":""},{"$f":"IF($B36=\"\",\"\",IFERROR(INDEX(Ingredients_DB!$Z$2:$Z$501, MATCH($B36, Ingredients_DB!$B$2:$B$501,0)),0))","v":""}]
[17,null,{"v":0,"d":"0.00"},"g",null,"",{"$f":"IF($B37=\"\",\"\",IFERROR(INDEX(Ingredients_DB!$K$2:$K$501, MATCH($B37, Ingredients_DB!$B$2:$B$501,0)),0))","v":""},"",{"$nulls":6},{"$f":"IF($B37=\"\",\"\",IFERROR(INDEX(Ingredients_DB!$H$2:$H$501, MATCH($B37, Ingredients_DB!$B$2:$B$501,0)),\"\"))","v":""},{"$f":"IF($B37=\"\",\"\",IFERROR(INDEX(Ingredients_DB!$I$2:$I$501, MATCH($B37, Ingredients_DB!$B$2:$B$501,0)),\"\"))","v":""},{"$f":"IF($B37=\"\",\"\",IFERROR(VLOOKUP($O37&\"|\"&$D37,UOM_Conversions!$A$2:$E$50,4,FALSE),\"CHECK UNIT\"))","v":""},{"$f":"IF($B37=\"\",\"\",IFERROR(INDEX(Ingredients_DB!$M$2:$M$501, MATCH($B37, Ingredients_DB!$B$2:$B$501,0)),0))","v":""},{"$f":"IF($B37=\"\",\"\",IFERROR(INDEX(Ingredients_DB!$N$2:$N$501, MATCH($B37, Ingredients_DB!$B$2:$B$501,0)),0))","v":""},{"$f":"IF($B37=\"\",\"\",IFERROR(INDEX(Ingredients_DB!$O$2:$O$501, MATCH($B37, Ingredients_DB!$B$2:$B$501,0)),0))","v":""},{"$f":"IF($B37=\"\",\"\",IFERROR(INDEX(Ingredients_DB!$P$2:$P$501, MATCH($B37, Ingredients_DB!$B$2:$B$501,0)),0))","v":""},{"$f":"IF($B37=\"\",\"\",IFERROR(INDEX(Ingredients_DB!$Q$2:$Q$501, MATCH($B37, Ingredients_DB!$B$2:$B$501,0)),0))","v":""},{"$f":"IF($B37=\"\",\"\",IFERROR(INDEX(Ingredients_DB!$R$2:$R$501, MATCH($B37, Ingredients_DB!$B$2:$B$501,0)),0))","v":""},{"$f":"IF($B37=\"\",\"\",IFERROR(INDEX(Ingredients_DB!$S$2:$S$501, MATCH($B37, Ingredients_DB!$B$2:$B$501,0)),0))","v":""},{"$f":"IF($B37=\"\",\"\",IFERROR(INDEX(Ingredients_DB!$T$2:$T$501, MATCH($B37, Ingredients_DB!$B$2:$B$501,0)),0))","v":""},{"$f":"IF($B37=\"\",\"\",IFERROR(INDEX(Ingredients_DB!$U$2:$U$501, MATCH($B37, Ingredients_DB!$B$2:$B$501,0)),0))","v":""},{"$f":"IF($B37=\"\",\"\",IFERROR(INDEX(Ingredients_DB!$V$2:$V$501, MATCH($B37, Ingredients_DB!$B$2:$B$501,0)),0))","v":""},{"$f":"IF($B37=\"\",\"\",IFERROR(INDEX(Ingredients_DB!$W$2:$W$501, MATCH($B37, Ingredients_DB!$B$2:$B$501,0)),0))","v":""},{"$f":"IF($B37=\"\",\"\",IFERROR(INDEX(Ingredients_DB!$X$2:$X$501, MATCH($B37, Ingredients_DB!$B$2:$B$501,0)),0))","v":""},{"$f":"IF($B37=\"\",\"\",IFERROR(INDEX(Ingredients_DB!$Y$2:$Y$501, MATCH($B37, Ingredients_DB!$B$2:$B$501,0)),0))","v":""},{"$f":"IF($B37=\"\",\"\",IFERROR(INDEX(Ingredients_DB!$Z$2:$Z$501, MATCH($B37, Ingredients_DB!$B$2:$B$501,0)),0))","v":""}]
[18,null,{"v":0,"d":"0.00"},"g",null,"",{"$f":"IF($B38=\"\",\"\",IFERROR(INDEX(Ingredients_DB!$K$2:$K$501, MATCH($B38, Ingredients_DB!$B$2:$B$501,0)),0))","v":""},"",{"$nulls":6},{"$f":"IF($B38=\"\",\"\",IFERROR(INDEX(Ingredients_DB!$H$2:$H$501, MATCH($B38, Ingredients_DB!$B$2:$B$501,0)),\"\"))","v":""},{"$f":"IF($B38=\"\",\"\",IFERROR(INDEX(Ingredients_DB!$I$2:$I$501, MATCH($B38, Ingredients_DB!$B$2:$B$501,0)),\"\"))","v":""},{"$f":"IF($B38=\"\",\"\",IFERROR(VLOOKUP($O38&\"|\"&$D38,UOM_Conversions!$A$2:$E$50,4,FALSE),\"CHECK UNIT\"))","v":""},{"$f":"IF($B38=\"\",\"\",IFERROR(INDEX(Ingredients_DB!$M$2:$M$501, MATCH($B38, Ingredients_DB!$B$2:$B$501,0)),0))","v":""},{"$f":"IF($B38=\"\",\"\",IFERROR(INDEX(Ingredients_DB!$N$2:$N$501, MATCH($B38, Ingredients_DB!$B$2:$B$501,0)),0))","v":""},{"$f":"IF($B38=\"\",\"\",IFERROR(INDEX(Ingredients_DB!$O$2:$O$501, MATCH($B38, Ingredients_DB!$B$2:$B$501,0)),0))","v":""},{"$f":"IF($B38=\"\",\"\",IFERROR(INDEX(Ingredients_DB!$P$2:$P$501, MATCH($B38, Ingredients_DB!$B$2:$B$501,0)),0))","v":""},{"$f":"IF($B38=\"\",\"\",IFERROR(INDEX(Ingredients_DB!$Q$2:$Q$501, MATCH($B38, Ingredients_DB!$B$2:$B$501,0)),0))","v":""},{"$f":"IF($B38=\"\",\"\",IFERROR(INDEX(Ingredients_DB!$R$2:$R$501, MATCH($B38, Ingredients_DB!$B$2:$B$501,0)),0))","v":""},{"$f":"IF($B38=\"\",\"\",IFERROR(INDEX(Ingredients_DB!$S$2:$S$501, MATCH($B38, Ingredients_DB!$B$2:$B$501,0)),0))","v":""},{"$f":"IF($B38=\"\",\"\",IFERROR(INDEX(Ingredients_DB!$T$2:$T$501, MATCH($B38, Ingredients_DB!$B$2:$B$501,0)),0))","v":""},{"$f":"IF($B38=\"\",\"\",IFERROR(INDEX(Ingredients_DB!$U$2:$U$501, MATCH($B38, Ingredients_DB!$B$2:$B$501,0)),0))","v":""},{"$f":"IF($B38=\"\",\"\",IFERROR(INDEX(Ingredients_DB!$V$2:$V$501, MATCH($B38, Ingredients_DB!$B$2:$B$501,0)),0))","v":""},{"$f":"IF($B38=\"\",\"\",IFERROR(INDEX(Ingredients_DB!$W$2:$W$501, MATCH($B38, Ingredients_DB!$B$2:$B$501,0)),0))","v":""},{"$f":"IF($B38=\"\",\"\",IFERROR(INDEX(Ingredients_DB!$X$2:$X$501, MATCH($B38, Ingredients_DB!$B$2:$B$501,0)),0))","v":""},{"$f":"IF($B38=\"\",\"\",IFERROR(INDEX(Ingredients_DB!$Y$2:$Y$501, MATCH($B38, Ingredients_DB!$B$2:$B$501,0)),0))","v":""},{"$f":"IF($B38=\"\",\"\",IFERROR(INDEX(Ingredients_DB!$Z$2:$Z$501, MATCH($B38, Ingredients_DB!$B$2:$B$501,0)),0))","v":""}]
[19,null,{"v":0,"d":"0.00"},"g",null,"",{"$f":"IF($B39=\"\",\"\",IFERROR(INDEX(Ingredients_DB!$K$2:$K$501, MATCH($B39, Ingredients_DB!$B$2:$B$501,0)),0))","v":""},"",{"$nulls":6},{"$f":"IF($B39=\"\",\"\",IFERROR(INDEX(Ingredients_DB!$H$2:$H$501, MATCH($B39, Ingredients_DB!$B$2:$B$501,0)),\"\"))","v":""},{"$f":"IF($B39=\"\",\"\",IFERROR(INDEX(Ingredients_DB!$I$2:$I$501, MATCH($B39, Ingredients_DB!$B$2:$B$501,0)),\"\"))","v":""},{"$f":"IF($B39=\"\",\"\",IFERROR(VLOOKUP($O39&\"|\"&$D39,UOM_Conversions!$A$2:$E$50,4,FALSE),\"CHECK UNIT\"))","v":""},{"$f":"IF($B39=\"\",\"\",IFERROR(INDEX(Ingredients_DB!$M$2:$M$501, MATCH($B39, Ingredients_DB!$B$2:$B$501,0)),0))","v":""},{"$f":"IF($B39=\"\",\"\",IFERROR(INDEX(Ingredients_DB!$N$2:$N$501, MATCH($B39, Ingredients_DB!$B$2:$B$501,0)),0))","v":""},{"$f":"IF($B39=\"\",\"\",IFERROR(INDEX(Ingredients_DB!$O$2:$O$501, MATCH($B39, Ingredients_DB!$B$2:$B$501,0)),0))","v":""},{"$f":"IF($B39=\"\",\"\",IFERROR(INDEX(Ingredients_DB!$P$2:$P$501, MATCH($B39, Ingredients_DB!$B$2:$B$501,0)),0))","v":""},{"$f":"IF($B39=\"\",\"\",IFERROR(INDEX(Ingredients_DB!$Q$2:$Q$501, MATCH($B39, Ingredients_DB!$B$2:$B$501,0)),0))","v":""},{"$f":"IF($B39=\"\",\"\",IFERROR(INDEX(Ingredients_DB!$R$2:$R$501, MATCH($B39, Ingredients_DB!$B$2:$B$501,0)),0))","v":""},{"$f":"IF($B39=\"\",\"\",IFERROR(INDEX(Ingredients_DB!$S$2:$S$501, MATCH($B39, Ingredients_DB!$B$2:$B$501,0)),0))","v":""},{"$f":"IF($B39=\"\",\"\",IFERROR(INDEX(Ingredients_DB!$T$2:$T$501, MATCH($B39, Ingredients_DB!$B$2:$B$501,0)),0))","v":""},{"$f":"IF($B39=\"\",\"\",IFERROR(INDEX(Ingredients_DB!$U$2:$U$501, MATCH($B39, Ingredients_DB!$B$2:$B$501,0)),0))","v":""},{"$f":"IF($B39=\"\",\"\",IFERROR(INDEX(Ingredients_DB!$V$2:$V$501, MATCH($B39, Ingredients_DB!$B$2:$B$501,0)),0))","v":""},{"$f":"IF($B39=\"\",\"\",IFERROR(INDEX(Ingredients_DB!$W$2:$W$501, MATCH($B39, Ingredients_DB!$B$2:$B$501,0)),0))","v":""},{"$f":"IF($B39=\"\",\"\",IFERROR(INDEX(Ingredients_DB!$X$2:$X$501, MATCH($B39, Ingredients_DB!$B$2:$B$501,0)),0))","v":""},{"$f":"IF($B39=\"\",\"\",IFERROR(INDEX(Ingredients_DB!$Y$2:$Y$501, MATCH($B39, Ingredients_DB!$B$2:$B$501,0)),0))","v":""},{"$f":"IF($B39=\"\",\"\",IFERROR(INDEX(Ingredients_DB!$Z$2:$Z$501, MATCH($B39, Ingredients_DB!$B$2:$B$501,0)),0))","v":""}]
[20,null,{"v":0,"d":"0.00"},"g",null,"",{"$f":"IF($B40=\"\",\"\",IFERROR(INDEX(Ingredients_DB!$K$2:$K$501, MATCH($B40, Ingredients_DB!$B$2:$B$501,0)),0))","v":""},"",{"$nulls":6},{"$f":"IF($B40=\"\",\"\",IFERROR(INDEX(Ingredients_DB!$H$2:$H$501, MATCH($B40, Ingredients_DB!$B$2:$B$501,0)),\"\"))","v":""},{"$f":"IF($B40=\"\",\"\",IFERROR(INDEX(Ingredients_DB!$I$2:$I$501, MATCH($B40, Ingredients_DB!$B$2:$B$501,0)),\"\"))","v":""},{"$f":"IF($B40=\"\",\"\",IFERROR(VLOOKUP($O40&\"|\"&$D40,UOM_Conversions!$A$2:$E$50,4,FALSE),\"CHECK UNIT\"))","v":""},{"$f":"IF($B40=\"\",\"\",IFERROR(INDEX(Ingredients_DB!$M$2:$M$501, MATCH($B40, Ingredients_DB!$B$2:$B$501,0)),0))","v":""},{"$f":"IF($B40=\"\",\"\",IFERROR(INDEX(Ingredients_DB!$N$2:$N$501, MATCH($B40, Ingredients_DB!$B$2:$B$501,0)),0))","v":""},{"$f":"IF($B40=\"\",\"\",IFERROR(INDEX(Ingredients_DB!$O$2:$O$501, MATCH($B40, Ingredients_DB!$B$2:$B$501,0)),0))","v":""},{"$f":"IF($B40=\"\",\"\",IFERROR(INDEX(Ingredients_DB!$P$2:$P$501, MATCH($B40, Ingredients_DB!$B$2:$B$501,0)),0))","v":""},{"$f":"IF($B40=\"\",\"\",IFERROR(INDEX(Ingredients_DB!$Q$2:$Q$501, MATCH($B40, Ingredients_DB!$B$2:$B$501,0)),0))","v":""},{"$f":"IF($B40=\"\",\"\",IFERROR(INDEX(Ingredients_DB!$R$2:$R$501, MATCH($B40, Ingredients_DB!$B$2:$B$501,0)),0))","v":""},{"$f":"IF($B40=\"\",\"\",IFERROR(INDEX(Ingredients_DB!$S$2:$S$501, MATCH($B40, Ingredients_DB!$B$2:$B$501,0)),0))","v":""},{"$f":"IF($B40=\"\",\"\",IFERROR(INDEX(Ingredients_DB!$T$2:$T$501, MATCH($B40, Ingredients_DB!$B$2:$B$501,0)),0))","v":""},{"$f":"IF($B40=\"\",\"\",IFERROR(INDEX(Ingredients_DB!$U$2:$U$501, MATCH($B40, Ingredients_DB!$B$2:$B$501,0)),0))","v":""},{"$f":"IF($B40=\"\",\"\",IFERROR(INDEX(Ingredients_DB!$V$2:$V$501, MATCH($B40, Ingredients_DB!$B$2:$B$501,0)),0))","v":""},{"$f":"IF($B40=\"\",\"\",IFERROR(INDEX(Ingredients_DB!$W$2:$W$501, MATCH($B40, Ingredients_DB!$B$2:$B$501,0)),0))","v":""},{"$f":"IF($B40=\"\",\"\",IFERROR(INDEX(Ingredients_DB!$X$2:$X$501, MATCH($B40, Ingredients_DB!$B$2:$B$501,0)),0))","v":""},{"$f":"IF($B40=\"\",\"\",IFERROR(INDEX(Ingredients_DB!$Y$2:$Y$501, MATCH($B40, Ingredients_DB!$B$2:$B$501,0)),0))","v":""},{"$f":"IF($B40=\"\",\"\",IFERROR(INDEX(Ingredients_DB!$Z$2:$Z$501, MATCH($B40, Ingredients_DB!$B$2:$B$501,0)),0))","v":""}]
[21,null,{"v":0,"d":"0.00"},"g",null,"",{"$f":"IF($B41=\"\",\"\",IFERROR(INDEX(Ingredients_DB!$K$2:$K$501, MATCH($B41, Ingredients_DB!$B$2:$B$501,0)),0))","v":""},"",{"$nulls":6},{"$f":"IF($B41=\"\",\"\",IFERROR(INDEX(Ingredients_DB!$H$2:$H$501, MATCH($B41, Ingredients_DB!$B$2:$B$501,0)),\"\"))","v":""},{"$f":"IF($B41=\"\",\"\",IFERROR(INDEX(Ingredients_DB!$I$2:$I$501, MATCH($B41, Ingredients_DB!$B$2:$B$501,0)),\"\"))","v":""},{"$f":"IF($B41=\"\",\"\",IFERROR(VLOOKUP($O41&\"|\"&$D41,UOM_Conversions!$A$2:$E$50,4,FALSE),\"CHECK UNIT\"))","v":""},{"$f":"IF($B41=\"\",\"\",IFERROR(INDEX(Ingredients_DB!$M$2:$M$501, MATCH($B41, Ingredients_DB!$B$2:$B$501,0)),0))","v":""},{"$f":"IF($B41=\"\",\"\",IFERROR(INDEX(Ingredients_DB!$N$2:$N$501, MATCH($B41, Ingredients_DB!$B$2:$B$501,0)),0))","v":""},{"$f":"IF($B41=\"\",\"\",IFERROR(INDEX(Ingredients_DB!$O$2:$O$501, MATCH($B41, Ingredients_DB!$B$2:$B$501,0)),0))","v":""},{"$f":"IF($B41=\"\",\"\",IFERROR(INDEX(Ingredients_DB!$P$2:$P$501, MATCH($B41, Ingredients_DB!$B$2:$B$501,0)),0))","v":""},{"$f":"IF($B41=\"\",\"\",IFERROR(INDEX(Ingredients_DB!$Q$2:$Q$501, MATCH($B41, Ingredients_DB!$B$2:$B$501,0)),0))","v":""},{"$f":"IF($B41=\"\",\"\",IFERROR(INDEX(Ingredients_DB!$R$2:$R$501, MATCH($B41, Ingredients_DB!$B$2:$B$501,0)),0))","v":""},{"$f":"IF($B41=\"\",\"\",IFERROR(INDEX(Ingredients_DB!$S$2:$S$501, MATCH($B41, Ingredients_DB!$B$2:$B$501,0)),0))","v":""},{"$f":"IF($B41=\"\",\"\",IFERROR(INDEX(Ingredients_DB!$T$2:$T$501, MATCH($B41, Ingredients_DB!$B$2:$B$501,0)),0))","v":""},{"$f":"IF($B41=\"\",\"\",IFERROR(INDEX(Ingredients_DB!$U$2:$U$501, MATCH($B41, Ingredients_DB!$B$2:$B$501,0)),0))","v":""},{"$f":"IF($B41=\"\",\"\",IFERROR(INDEX(Ingredients_DB!$V$2:$V$501, MATCH($B41, Ingredients_DB!$B$2:$B$501,0)),0))","v":""},{"$f":"IF($B41=\"\",\"\",IFERROR(INDEX(Ingredients_DB!$W$2:$W$501, MATCH($B41, Ingredients_DB!$B$2:$B$501,0)),0))","v":""},{"$f":"IF($B41=\"\",\"\",IFERROR(INDEX(Ingredients_DB!$X$2:$X$501, MATCH($B41, Ingredients_DB!$B$2:$B$501,0)),0))","v":""},{"$f":"IF($B41=\"\",\"\",IFERROR(INDEX(Ingredients_DB!$Y$2:$Y$501, MATCH($B41, Ingredients_DB!$B$2:$B$501,0)),0))","v":""},{"$f":"IF($B41=\"\",\"\",IFERROR(INDEX(Ingredients_DB!$Z$2:$Z$501, MATCH($B41, Ingredients_DB!$B$2:$B$501,0)),0))","v":""}]
[22,null,{"v":0,"d":"0.00"},"g",null,"",{"$f":"IF($B42=\"\",\"\",IFERROR(INDEX(Ingredients_DB!$K$2:$K$501, MATCH($B42, Ingredients_DB!$B$2:$B$501,0)),0))","v":""},"",{"$nulls":6},{"$f":"IF($B42=\"\",\"\",IFERROR(INDEX(Ingredients_DB!$H$2:$H$501, MATCH($B42, Ingredients_DB!$B$2:$B$501,0)),\"\"))","v":""},{"$f":"IF($B42=\"\",\"\",IFERROR(INDEX(Ingredients_DB!$I$2:$I$501, MATCH($B42, Ingredients_DB!$B$2:$B$501,0)),\"\"))","v":""},{"$f":"IF($B42=\"\",\"\",IFERROR(VLOOKUP($O42&\"|\"&$D42,UOM_Conversions!$A$2:$E$50,4,FALSE),\"CHECK UNIT\"))","v":""},{"$f":"IF($B42=\"\",\"\",IFERROR(INDEX(Ingredients_DB!$M$2:$M$501, MATCH($B42, Ingredients_DB!$B$2:$B$501,0)),0))","v":""},{"$f":"IF($B42=\"\",\"\",IFERROR(INDEX(Ingredients_DB!$N$2:$N$501, MATCH($B42, Ingredients_DB!$B$2:$B$501,0)),0))","v":""},{"$f":"IF($B42=\"\",\"\",IFERROR(INDEX(Ingredients_DB!$O$2:$O$501, MATCH($B42, Ingredients_DB!$B$2:$B$501,0)),0))","v":""},{"$f":"IF($B42=\"\",\"\",IFERROR(INDEX(Ingredients_DB!$P$2:$P$501, MATCH($B42, Ingredients_DB!$B$2:$B$501,0)),0))","v":""},{"$f":"IF($B42=\"\",\"\",IFERROR(INDEX(Ingredients_DB!$Q$2:$Q$501, MATCH($B42, Ingredients_DB!$B$2:$B$501,0)),0))","v":""},{"$f":"IF($B42=\"\",\"\",IFERROR(INDEX(Ingredients_DB!$R$2:$R$501, MATCH($B42, Ingredients_DB!$B$2:$B$501,0)),0))","v":""},{"$f":"IF($B42=\"\",\"\",IFERROR(INDEX(Ingredients_DB!$S$2:$S$501, MATCH($B42, Ingredients_DB!$B$2:$B$501,0)),0))","v":""},{"$f":"IF($B42=\"\",\"\",IFERROR(INDEX(Ingredients_DB!$T$2:$T$501, MATCH($B42, Ingredients_DB!$B$2:$B$501,0)),0))","v":""},{"$f":"IF($B42=\"\",\"\",IFERROR(INDEX(Ingredients_DB!$U$2:$U$501, MATCH($B42, Ingredients_DB!$B$2:$B$501,0)),0))","v":""},{"$f":"IF($B42=\"\",\"\",IFERROR(INDEX(Ingredients_DB!$V$2:$V$501, MATCH($B42, Ingredients_DB!$B$2:$B$501,0)),0))","v":""},{"$f":"IF($B42=\"\",\"\",IFERROR(INDEX(Ingredients_DB!$W$2:$W$501, MATCH($B42, Ingredients_DB!$B$2:$B$501,0)),0))","v":""},{"$f":"IF($B42=\"\",\"\",IFERROR(INDEX(Ingredients_DB!$X$2:$X$501, MATCH($B42, Ingredients_DB!$B$2:$B$501,0)),0))","v":""},{"$f":"IF($B42=\"\",\"\",IFERROR(INDEX(Ingredients_DB!$Y$2:$Y$501, MATCH($B42, Ingredients_DB!$B$2:$B$501,0)),0))","v":""},{"$f":"IF($B42=\"\",\"\",IFERROR(INDEX(Ingredients_DB!$Z$2:$Z$501, MATCH($B42, Ingredients_DB!$B$2:$B$501,0)),0))","v":""}]
[23,null,{"v":0,"d":"0.00"},"g",null,"",{"$f":"IF($B43=\"\",\"\",IFERROR(INDEX(Ingredients_DB!$K$2:$K$501, MATCH($B43, Ingredients_DB!$B$2:$B$501,0)),0))","v":""},"",{"$nulls":6},{"$f":"IF($B43=\"\",\"\",IFERROR(INDEX(Ingredients_DB!$H$2:$H$501, MATCH($B43, Ingredients_DB!$B$2:$B$501,0)),\"\"))","v":""},{"$f":"IF($B43=\"\",\"\",IFERROR(INDEX(Ingredients_DB!$I$2:$I$501, MATCH($B43, Ingredients_DB!$B$2:$B$501,0)),\"\"))","v":""},{"$f":"IF($B43=\"\",\"\",IFERROR(VLOOKUP($O43&\"|\"&$D43,UOM_Conversions!$A$2:$E$50,4,FALSE),\"CHECK UNIT\"))","v":""},{"$f":"IF($B43=\"\",\"\",IFERROR(INDEX(Ingredients_DB!$M$2:$M$501, MATCH($B43, Ingredients_DB!$B$2:$B$501,0)),0))","v":""},{"$f":"IF($B43=\"\",\"\",IFERROR(INDEX(Ingredients_DB!$N$2:$N$501, MATCH($B43, Ingredients_DB!$B$2:$B$501,0)),0))","v":""},{"$f":"IF($B43=\"\",\"\",IFERROR(INDEX(Ingredients_DB!$O$2:$O$501, MATCH($B43, Ingredients_DB!$B$2:$B$501,0)),0))","v":""},{"$f":"IF($B43=\"\",\"\",IFERROR(INDEX(Ingredients_DB!$P$2:$P$501, MATCH($B43, Ingredients_DB!$B$2:$B$501,0)),0))","v":""},{"$f":"IF($B43=\"\",\"\",IFERROR(INDEX(Ingredients_DB!$Q$2:$Q$501, MATCH($B43, Ingredients_DB!$B$2:$B$501,0)),0))","v":""},{"$f":"IF($B43=\"\",\"\",IFERROR(INDEX(Ingredients_DB!$R$2:$R$501, MATCH($B43, Ingredients_DB!$B$2:$B$501,0)),0))","v":""},{"$f":"IF($B43=\"\",\"\",IFERROR(INDEX(Ingredients_DB!$S$2:$S$501, MATCH($B43, Ingredients_DB!$B$2:$B$501,0)),0))","v":""},{"$f":"IF($B43=\"\",\"\",IFERROR(INDEX(Ingredients_DB!$T$2:$T$501, MATCH($B43, Ingredients_DB!$B$2:$B$501,0)),0))","v":""},{"$f":"IF($B43=\"\",\"\",IFERROR(INDEX(Ingredients_DB!$U$2:$U$501, MATCH($B43, Ingredients_DB!$B$2:$B$501,0)),0))","v":""},{"$f":"IF($B43=\"\",\"\",IFERROR(INDEX(Ingredients_DB!$V$2:$V$501, MATCH($B43, Ingredients_DB!$B$2:$B$501,0)),0))","v":""},{"$f":"IF($B43=\"\",\"\",IFERROR(INDEX(Ingredients_DB!$W$2:$W$501, MATCH($B43, Ingredients_DB!$B$2:$B$501,0)),0))","v":""},{"$f":"IF($B43=\"\",\"\",IFERROR(INDEX(Ingredients_DB!$X$2:$X$501, MATCH($B43, Ingredients_DB!$B$2:$B$501,0)),0))","v":""},{"$f":"IF($B43=\"\",\"\",IFERROR(INDEX(Ingredients_DB!$Y$2:$Y$501, MATCH($B43, Ingredients_DB!$B$2:$B$501,0)),0))","v":""},{"$f":"IF($B43=\"\",\"\",IFERROR(INDEX(Ingredients_DB!$Z$2:$Z$501, MATCH($B43, Ingredients_DB!$B$2:$B$501,0)),0))","v":""}]
[24,null,{"v":0,"d":"0.00"},"g",null,"",{"$f":"IF($B44=\"\",\"\",IFERROR(INDEX(Ingredients_DB!$K$2:$K$501, MATCH($B44, Ingredients_DB!$B$2:$B$501,0)),0))","v":""},"",{"$nulls":6},{"$f":"IF($B44=\"\",\"\",IFERROR(INDEX(Ingredients_DB!$H$2:$H$501, MATCH($B44, Ingredients_DB!$B$2:$B$501,0)),\"\"))","v":""},{"$f":"IF($B44=\"\",\"\",IFERROR(INDEX(Ingredients_DB!$I$2:$I$501, MATCH($B44, Ingredients_DB!$B$2:$B$501,0)),\"\"))","v":""},{"$f":"IF($B44=\"\",\"\",IFERROR(VLOOKUP($O44&\"|\"&$D44,UOM_Conversions!$A$2:$E$50,4,FALSE),\"CHECK UNIT\"))","v":""},{"$f":"IF($B44=\"\",\"\",IFERROR(INDEX(Ingredients_DB!$M$2:$M$501, MATCH($B44, Ingredients_DB!$B$2:$B$501,0)),0))","v":""},{"$f":"IF($B44=\"\",\"\",IFERROR(INDEX(Ingredients_DB!$N$2:$N$501, MATCH($B44, Ingredients_DB!$B$2:$B$501,0)),0))","v":""},{"$f":"IF($B44=\"\",\"\",IFERROR(INDEX(Ingredients_DB!$O$2:$O$501, MATCH($B44, Ingredients_DB!$B$2:$B$501,0)),0))","v":""},{"$f":"IF($B44=\"\",\"\",IFERROR(INDEX(Ingredients_DB!$P$2:$P$501, MATCH($B44, Ingredients_DB!$B$2:$B$501,0)),0))","v":""},{"$f":"IF($B44=\"\",\"\",IFERROR(INDEX(Ingredients_DB!$Q$2:$Q$501, MATCH($B44, Ingredients_DB!$B$2:$B$501,0)),0))","v":""},{"$f":"IF($B44=\"\",\"\",IFERROR(INDEX(Ingredients_DB!$R$2:$R$501, MATCH($B44, Ingredients_DB!$B$2:$B$501,0)),0))","v":""},{"$f":"IF($B44=\"\",\"\",IFERROR(INDEX(Ingredients_DB!$S$2:$S$501, MATCH($B44, Ingredients_DB!$B$2:$B$501,0)),0))","v":""},{"$f":"IF($B44=\"\",\"\",IFERROR(INDEX(Ingredients_DB!$T$2:$T$501, MATCH($B44, Ingredients_DB!$B$2:$B$501,0)),0))","v":""},{"$f":"IF($B44=\"\",\"\",IFERROR(INDEX(Ingredients_DB!$U$2:$U$501, MATCH($B44, Ingredients_DB!$B$2:$B$501,0)),0))","v":""},{"$f":"IF($B44=\"\",\"\",IFERROR(INDEX(Ingredients_DB!$V$2:$V$501, MATCH($B44, Ingredients_DB!$B$2:$B$501,0)),0))","v":""},{"$f":"IF($B44=\"\",\"\",IFERROR(INDEX(Ingredients_DB!$W$2:$W$501, MATCH($B44, Ingredients_DB!$B$2:$B$501,0)),0))","v":""},{"$f":"IF($B44=\"\",\"\",IFERROR(INDEX(Ingredients_DB!$X$2:$X$501, MATCH($B44, Ingredients_DB!$B$2:$B$501,0)),0))","v":""},{"$f":"IF($B44=\"\",\"\",IFERROR(INDEX(Ingredients_DB!$Y$2:$Y$501, MATCH($B44, Ingredients_DB!$B$2:$B$501,0)),0))","v":""},{"$f":"IF($B44=\"\",\"\",IFERROR(INDEX(Ingredients_DB!$Z$2:$Z$501, MATCH($B44, Ingredients_DB!$B$2:$B$501,0)),0))","v":""}]
[25,null,{"v":0,"d":"0.00"},"g",null,"",{"$f":"IF($B45=\"\",\"\",IFERROR(INDEX(Ingredients_DB!$K$2:$K$501, MATCH($B45, Ingredients_DB!$B$2:$B$501,0)),0))","v":""},"",{"$nulls":6},{"$f":"IF($B45=\"\",\"\",IFERROR(INDEX(Ingredients_DB!$H$2:$H$501, MATCH($B45, Ingredients_DB!$B$2:$B$501,0)),\"\"))","v":""},{"$f":"IF($B45=\"\",\"\",IFERROR(INDEX(Ingredients_DB!$I$2:$I$501, MATCH($B45, Ingredients_DB!$B$2:$B$501,0)),\"\"))","v":""},{"$f":"IF($B45=\"\",\"\",IFERROR(VLOOKUP($O45&\"|\"&$D45,UOM_Conversions!$A$2:$E$50,4,FALSE),\"CHECK UNIT\"))","v":""},{"$f":"IF($B45=\"\",\"\",IFERROR(INDEX(Ingredients_DB!$M$2:$M$501, MATCH($B45, Ingredients_DB!$B$2:$B$501,0)),0))","v":""},{"$f":"IF($B45=\"\",\"\",IFERROR(INDEX(Ingredients_DB!$N$2:$N$501, MATCH($B45, Ingredients_DB!$B$2:$B$501,0)),0))","v":""},{"$f":"IF($B45=\"\",\"\",IFERROR(INDEX(Ingredients_DB!$O$2:$O$501, MATCH($B45, Ingredients_DB!$B$2:$B$501,0)),0))","v":""},{"$f":"IF($B45=\"\",\"\",IFERROR(INDEX(Ingredients_DB!$P$2:$P$501, MATCH($B45, Ingredients_DB!$B$2:$B$501,0)),0))","v":""},{"$f":"IF($B45=\"\",\"\",IFERROR(INDEX(Ingredients_DB!$Q$2:$Q$501, MATCH($B45, Ingredients_DB!$B$2:$B$501,0)),0))","v":""},{"$f":"IF($B45=\"\",\"\",IFERROR(INDEX(Ingredients_DB!$R$2:$R$501, MATCH($B45, Ingredients_DB!$B$2:$B$501,0)),0))","v":""},{"$f":"IF($B45=\"\",\"\",IFERROR(INDEX(Ingredients_DB!$S$2:$S$501, MATCH($B45, Ingredients_DB!$B$2:$B$501,0)),0))","v":""},{"$f":"IF($B45=\"\",\"\",IFERROR(INDEX(Ingredients_DB!$T$2:$T$501, MATCH($B45, Ingredients_DB!$B$2:$B$501,0)),0))","v":""},{"$f":"IF($B45=\"\",\"\",IFERROR(INDEX(Ingredients_DB!$U$2:$U$501, MATCH($B45, Ingredients_DB!$B$2:$B$501,0)),0))","v":""},{"$f":"IF($B45=\"\",\"\",IFERROR(INDEX(Ingredients_DB!$V$2:$V$501, MATCH($B45, Ingredients_DB!$B$2:$B$501,0)),0))","v":""},{"$f":"IF($B45=\"\",\"\",IFERROR(INDEX(Ingredients_DB!$W$2:$W$501, MATCH($B45, Ingredients_DB!$B$2:$B$501,0)),0))","v":""},{"$f":"IF($B45=\"\",\"\",IFERROR(INDEX(Ingredients_DB!$X$2:$X$501, MATCH($B45, Ingredients_DB!$B$2:$B$501,0)),0))","v":""},{"$f":"IF($B45=\"\",\"\",IFERROR(INDEX(Ingredients_DB!$Y$2:$Y$501, MATCH($B45, Ingredients_DB!$B$2:$B$501,0)),0))","v":""},{"$f":"IF($B45=\"\",\"\",IFERROR(INDEX(Ingredients_DB!$Z$2:$Z$501, MATCH($B45, Ingredients_DB!$B$2:$B$501,0)),0))","v":""}]
[26,null,{"v":0,"d":"0.00"},"g",null,"",{"$f":"IF($B46=\"\",\"\",IFERROR(INDEX(Ingredients_DB!$K$2:$K$501, MATCH($B46, Ingredients_DB!$B$2:$B$501,0)),0))","v":""},"",{"$nulls":6},{"$f":"IF($B46=\"\",\"\",IFERROR(INDEX(Ingredients_DB!$H$2:$H$501, MATCH($B46, Ingredients_DB!$B$2:$B$501,0)),\"\"))","v":""},{"$f":"IF($B46=\"\",\"\",IFERROR(INDEX(Ingredients_DB!$I$2:$I$501, MATCH($B46, Ingredients_DB!$B$2:$B$501,0)),\"\"))","v":""},{"$f":"IF($B46=\"\",\"\",IFERROR(VLOOKUP($O46&\"|\"&$D46,UOM_Conversions!$A$2:$E$50,4,FALSE),\"CHECK UNIT\"))","v":""},{"$f":"IF($B46=\"\",\"\",IFERROR(INDEX(Ingredients_DB!$M$2:$M$501, MATCH($B46, Ingredients_DB!$B$2:$B$501,0)),0))","v":""},{"$f":"IF($B46=\"\",\"\",IFERROR(INDEX(Ingredients_DB!$N$2:$N$501, MATCH($B46, Ingredients_DB!$B$2:$B$501,0)),0))","v":""},{"$f":"IF($B46=\"\",\"\",IFERROR(INDEX(Ingredients_DB!$O$2:$O$501, MATCH($B46, Ingredients_DB!$B$2:$B$501,0)),0))","v":""},{"$f":"IF($B46=\"\",\"\",IFERROR(INDEX(Ingredients_DB!$P$2:$P$501, MATCH($B46, Ingredients_DB!$B$2:$B$501,0)),0))","v":""},{"$f":"IF($B46=\"\",\"\",IFERROR(INDEX(Ingredients_DB!$Q$2:$Q$501, MATCH($B46, Ingredients_DB!$B$2:$B$501,0)),0))","v":""},{"$f":"IF($B46=\"\",\"\",IFERROR(INDEX(Ingredients_DB!$R$2:$R$501, MATCH($B46, Ingredients_DB!$B$2:$B$501,0)),0))","v":""},{"$f":"IF($B46=\"\",\"\",IFERROR(INDEX(Ingredients_DB!$S$2:$S$501, MATCH($B46, Ingredients_DB!$B$2:$B$501,0)),0))","v":""},{"$f":"IF($B46=\"\",\"\",IFERROR(INDEX(Ingredients_DB!$T$2:$T$501, MATCH($B46, Ingredients_DB!$B$2:$B$501,0)),0))","v":""},{"$f":"IF($B46=\"\",\"\",IFERROR(INDEX(Ingredients_DB!$U$2:$U$501, MATCH($B46, Ingredients_DB!$B$2:$B$501,0)),0))","v":""},{"$f":"IF($B46=\"\",\"\",IFERROR(INDEX(Ingredients_DB!$V$2:$V$501, MATCH($B46, Ingredients_DB!$B$2:$B$501,0)),0))","v":""},{"$f":"IF($B46=\"\",\"\",IFERROR(INDEX(Ingredients_DB!$W$2:$W$501, MATCH($B46, Ingredients_DB!$B$2:$B$501,0)),0))","v":""},{"$f":"IF($B46=\"\",\"\",IFERROR(INDEX(Ingredients_DB!$X$2:$X$501, MATCH($B46, Ingredients_DB!$B$2:$B$501,0)),0))","v":""},{"$f":"IF($B46=\"\",\"\",IFERROR(INDEX(Ingredients_DB!$Y$2:$Y$501, MATCH($B46, Ingredients_DB!$B$2:$B$501,0)),0))","v":""},{"$f":"IF($B46=\"\",\"\",IFERROR(INDEX(Ingredients_DB!$Z$2:$Z$501, MATCH($B46, Ingredients_DB!$B$2:$B$501,0)),0))","v":""}]
[27,null,{"v":0,"d":"0.00"},"g",null,"",{"$f":"IF($B47=\"\",\"\",IFERROR(INDEX(Ingredients_DB!$K$2:$K$501, MATCH($B47, Ingredients_DB!$B$2:$B$501,0)),0))","v":""},"",{"$nulls":6},{"$f":"IF($B47=\"\",\"\",IFERROR(INDEX(Ingredients_DB!$H$2:$H$501, MATCH($B47, Ingredients_DB!$B$2:$B$501,0)),\"\"))","v":""},{"$f":"IF($B47=\"\",\"\",IFERROR(INDEX(Ingredients_DB!$I$2:$I$501, MATCH($B47, Ingredients_DB!$B$2:$B$501,0)),\"\"))","v":""},{"$f":"IF($B47=\"\",\"\",IFERROR(VLOOKUP($O47&\"|\"&$D47,UOM_Conversions!$A$2:$E$50,4,FALSE),\"CHECK UNIT\"))","v":""},{"$f":"IF($B47=\"\",\"\",IFERROR(INDEX(Ingredients_DB!$M$2:$M$501, MATCH($B47, Ingredients_DB!$B$2:$B$501,0)),0))","v":""},{"$f":"IF($B47=\"\",\"\",IFERROR(INDEX(Ingredients_DB!$N$2:$N$501, MATCH($B47, Ingredients_DB!$B$2:$B$501,0)),0))","v":""},{"$f":"IF($B47=\"\",\"\",IFERROR(INDEX(Ingredients_DB!$O$2:$O$501, MATCH($B47, Ingredients_DB!$B$2:$B$501,0)),0))","v":""},{"$f":"IF($B47=\"\",\"\",IFERROR(INDEX(Ingredients_DB!$P$2:$P$501, MATCH($B47, Ingredients_DB!$B$2:$B$501,0)),0))","v":""},{"$f":"IF($B47=\"\",\"\",IFERROR(INDEX(Ingredients_DB!$Q$2:$Q$501, MATCH($B47, Ingredients_DB!$B$2:$B$501,0)),0))","v":""},{"$f":"IF($B47=\"\",\"\",IFERROR(INDEX(Ingredients_DB!$R$2:$R$501, MATCH($B47, Ingredients_DB!$B$2:$B$501,0)),0))","v":""},{"$f":"IF($B47=\"\",\"\",IFERROR(INDEX(Ingredients_DB!$S$2:$S$501, MATCH($B47, Ingredients_DB!$B$2:$B$501,0)),0))","v":""},{"$f":"IF($B47=\"\",\"\",IFERROR(INDEX(Ingredients_DB!$T$2:$T$501, MATCH($B47, Ingredients_DB!$B$2:$B$501,0)),0))","v":""},{"$f":"IF($B47=\"\",\"\",IFERROR(INDEX(Ingredients_DB!$U$2:$U$501, MATCH($B47, Ingredients_DB!$B$2:$B$501,0)),0))","v":""},{"$f":"IF($B47=\"\",\"\",IFERROR(INDEX(Ingredients_DB!$V$2:$V$501, MATCH($B47, Ingredients_DB!$B$2:$B$501,0)),0))","v":""},{"$f":"IF($B47=\"\",\"\",IFERROR(INDEX(Ingredients_DB!$W$2:$W$501, MATCH($B47, Ingredients_DB!$B$2:$B$501,0)),0))","v":""},{"$f":"IF($B47=\"\",\"\",IFERROR(INDEX(Ingredients_DB!$X$2:$X$501, MATCH($B47, Ingredients_DB!$B$2:$B$501,0)),0))","v":""},{"$f":"IF($B47=\"\",\"\",IFERROR(INDEX(Ingredients_DB!$Y$2:$Y$501, MATCH($B47, Ingredients_DB!$B$2:$B$501,0)),0))","v":""},{"$f":"IF($B47=\"\",\"\",IFERROR(INDEX(Ingredients_DB!$Z$2:$Z$501, MATCH($B47, Ingredients_DB!$B$2:$B$501,0)),0))","v":""}]
[28,null,{"v":0,"d":"0.00"},"g",null,"",{"$f":"IF($B48=\"\",\"\",IFERROR(INDEX(Ingredients_DB!$K$2:$K$501, MATCH($B48, Ingredients_DB!$B$2:$B$501,0)),0))","v":""},"",{"$nulls":6},{"$f":"IF($B48=\"\",\"\",IFERROR(INDEX(Ingredients_DB!$H$2:$H$501, MATCH($B48, Ingredients_DB!$B$2:$B$501,0)),\"\"))","v":""},{"$f":"IF($B48=\"\",\"\",IFERROR(INDEX(Ingredients_DB!$I$2:$I$501, MATCH($B48, Ingredients_DB!$B$2:$B$501,0)),\"\"))","v":""},{"$f":"IF($B48=\"\",\"\",IFERROR(VLOOKUP($O48&\"|\"&$D48,UOM_Conversions!$A$2:$E$50,4,FALSE),\"CHECK UNIT\"))","v":""},{"$f":"IF($B48=\"\",\"\",IFERROR(INDEX(Ingredients_DB!$M$2:$M$501, MATCH($B48, Ingredients_DB!$B$2:$B$501,0)),0))","v":""},{"$f":"IF($B48=\"\",\"\",IFERROR(INDEX(Ingredients_DB!$N$2:$N$501, MATCH($B48, Ingredients_DB!$B$2:$B$501,0)),0))","v":""},{"$f":"IF($B48=\"\",\"\",IFERROR(INDEX(Ingredients_DB!$O$2:$O$501, MATCH($B48, Ingredients_DB!$B$2:$B$501,0)),0))","v":""},{"$f":"IF($B48=\"\",\"\",IFERROR(INDEX(Ingredients_DB!$P$2:$P$501, MATCH($B48, Ingredients_DB!$B$2:$B$501,0)),0))","v":""},{"$f":"IF($B48=\"\",\"\",IFERROR(INDEX(Ingredients_DB!$Q$2:$Q$501, MATCH($B48, Ingredients_DB!$B$2:$B$501,0)),0))","v":""},{"$f":"IF($B48=\"\",\"\",IFERROR(INDEX(Ingredients_DB!$R$2:$R$501, MATCH($B48, Ingredients_DB!$B$2:$B$501,0)),0))","v":""},{"$f":"IF($B48=\"\",\"\",IFERROR(INDEX(Ingredients_DB!$S$2:$S$501, MATCH($B48, Ingredients_DB!$B$2:$B$501,0)),0))","v":""},{"$f":"IF($B48=\"\",\"\",IFERROR(INDEX(Ingredients_DB!$T$2:$T$501, MATCH($B48, Ingredients_DB!$B$2:$B$501,0)),0))","v":""},{"$f":"IF($B48=\"\",\"\",IFERROR(INDEX(Ingredients_DB!$U$2:$U$501, MATCH($B48, Ingredients_DB!$B$2:$B$501,0)),0))","v":""},{"$f":"IF($B48=\"\",\"\",IFERROR(INDEX(Ingredients_DB!$V$2:$V$501, MATCH($B48, Ingredients_DB!$B$2:$B$501,0)),0))","v":""},{"$f":"IF($B48=\"\",\"\",IFERROR(INDEX(Ingredients_DB!$W$2:$W$501, MATCH($B48, Ingredients_DB!$B$2:$B$501,0)),0))","v":""},{"$f":"IF($B48=\"\",\"\",IFERROR(INDEX(Ingredients_DB!$X$2:$X$501, MATCH($B48, Ingredients_DB!$B$2:$B$501,0)),0))","v":""},{"$f":"IF($B48=\"\",\"\",IFERROR(INDEX(Ingredients_DB!$Y$2:$Y$501, MATCH($B48, Ingredients_DB!$B$2:$B$501,0)),0))","v":""},{"$f":"IF($B48=\"\",\"\",IFERROR(INDEX(Ingredients_DB!$Z$2:$Z$501, MATCH($B48, Ingredients_DB!$B$2:$B$501,0)),0))","v":""}]
[29,null,{"v":0,"d":"0.00"},"g",null,"",{"$f":"IF($B49=\"\",\"\",IFERROR(INDEX(Ingredients_DB!$K$2:$K$501, MATCH($B49, Ingredients_DB!$B$2:$B$501,0)),0))","v":""},"",{"$nulls":6},{"$f":"IF($B49=\"\",\"\",IFERROR(INDEX(Ingredients_DB!$H$2:$H$501, MATCH($B49, Ingredients_DB!$B$2:$B$501,0)),\"\"))","v":""},{"$f":"IF($B49=\"\",\"\",IFERROR(INDEX(Ingredients_DB!$I$2:$I$501, MATCH($B49, Ingredients_DB!$B$2:$B$501,0)),\"\"))","v":""},{"$f":"IF($B49=\"\",\"\",IFERROR(VLOOKUP($O49&\"|\"&$D49,UOM_Conversions!$A$2:$E$50,4,FALSE),\"CHECK UNIT\"))","v":""},{"$f":"IF($B49=\"\",\"\",IFERROR(INDEX(Ingredients_DB!$M$2:$M$501, MATCH($B49, Ingredients_DB!$B$2:$B$501,0)),0))","v":""},{"$f":"IF($B49=\"\",\"\",IFERROR(INDEX(Ingredients_DB!$N$2:$N$501, MATCH($B49, Ingredients_DB!$B$2:$B$501,0)),0))","v":""},{"$f":"IF($B49=\"\",\"\",IFERROR(INDEX(Ingredients_DB!$O$2:$O$501, MATCH($B49, Ingredients_DB!$B$2:$B$501,0)),0))","v":""},{"$f":"IF($B49=\"\",\"\",IFERROR(INDEX(Ingredients_DB!$P$2:$P$501, MATCH($B49, Ingredients_DB!$B$2:$B$501,0)),0))","v":""},{"$f":"IF($B49=\"\",\"\",IFERROR(INDEX(Ingredients_DB!$Q$2:$Q$501, MATCH($B49, Ingredients_DB!$B$2:$B$501,0)),0))","v":""},{"$f":"IF($B49=\"\",\"\",IFERROR(INDEX(Ingredients_DB!$R$2:$R$501, MATCH($B49, Ingredients_DB!$B$2:$B$501,0)),0))","v":""},{"$f":"IF($B49=\"\",\"\",IFERROR(INDEX(Ingredients_DB!$S$2:$S$501, MATCH($B49, Ingredients_DB!$B$2:$B$501,0)),0))","v":""},{"$f":"IF($B49=\"\",\"\",IFERROR(INDEX(Ingredients_DB!$T$2:$T$501, MATCH($B49, Ingredients_DB!$B$2:$B$501,0)),0))","v":""},{"$f":"IF($B49=\"\",\"\",IFERROR(INDEX(Ingredients_DB!$U$2:$U$501, MATCH($B49, Ingredients_DB!$B$2:$B$501,0)),0))","v":""},{"$f":"IF($B49=\"\",\"\",IFERROR(INDEX(Ingredients_DB!$V$2:$V$501, MATCH($B49, Ingredients_DB!$B$2:$B$501,0)),0))","v":""},{"$f":"IF($B49=\"\",\"\",IFERROR(INDEX(Ingredients_DB!$W$2:$W$501, MATCH($B49, Ingredients_DB!$B$2:$B$501,0)),0))","v":""},{"$f":"IF($B49=\"\",\"\",IFERROR(INDEX(Ingredients_DB!$X$2:$X$501, MATCH($B49, Ingredients_DB!$B$2:$B$501,0)),0))","v":""},{"$f":"IF($B49=\"\",\"\",IFERROR(INDEX(Ingredients_DB!$Y$2:$Y$501, MATCH($B49, Ingredients_DB!$B$2:$B$501,0)),0))","v":""},{"$f":"IF($B49=\"\",\"\",IFERROR(INDEX(Ingredients_DB!$Z$2:$Z$501, MATCH($B49, Ingredients_DB!$B$2:$B$501,0)),0))","v":""}]
[30,null,{"v":0,"d":"0.00"},"g",null,"",{"$f":"IF($B50=\"\",\"\",IFERROR(INDEX(Ingredients_DB!$K$2:$K$501, MATCH($B50, Ingredients_DB!$B$2:$B$501,0)),0))","v":""},"",{"$nulls":6},{"$f":"IF($B50=\"\",\"\",IFERROR(INDEX(Ingredients_DB!$H$2:$H$501, MATCH($B50, Ingredients_DB!$B$2:$B$501,0)),\"\"))","v":""},{"$f":"IF($B50=\"\",\"\",IFERROR(INDEX(Ingredients_DB!$I$2:$I$501, MATCH($B50, Ingredients_DB!$B$2:$B$501,0)),\"\"))","v":""},{"$f":"IF($B50=\"\",\"\",IFERROR(VLOOKUP($O50&\"|\"&$D50,UOM_Conversions!$A$2:$E$50,4,FALSE),\"CHECK UNIT\"))","v":""},{"$f":"IF($B50=\"\",\"\",IFERROR(INDEX(Ingredients_DB!$M$2:$M$501, MATCH($B50, Ingredients_DB!$B$2:$B$501,0)),0))","v":""},{"$f":"IF($B50=\"\",\"\",IFERROR(INDEX(Ingredients_DB!$N$2:$N$501, MATCH($B50, Ingredients_DB!$B$2:$B$501,0)),0))","v":""},{"$f":"IF($B50=\"\",\"\",IFERROR(INDEX(Ingredients_DB!$O$2:$O$501, MATCH($B50, Ingredients_DB!$B$2:$B$501,0)),0))","v":""},{"$f":"IF($B50=\"\",\"\",IFERROR(INDEX(Ingredients_DB!$P$2:$P$501, MATCH($B50, Ingredients_DB!$B$2:$B$501,0)),0))","v":""},{"$f":"IF($B50=\"\",\"\",IFERROR(INDEX(Ingredients_DB!$Q$2:$Q$501, MATCH($B50, Ingredients_DB!$B$2:$B$501,0)),0))","v":""},{"$f":"IF($B50=\"\",\"\",IFERROR(INDEX(Ingredients_DB!$R$2:$R$501, MATCH($B50, Ingredients_DB!$B$2:$B$501,0)),0))","v":""},{"$f":"IF($B50=\"\",\"\",IFERROR(INDEX(Ingredients_DB!$S$2:$S$501, MATCH($B50, Ingredients_DB!$B$2:$B$501,0)),0))","v":""},{"$f":"IF($B50=\"\",\"\",IFERROR(INDEX(Ingredients_DB!$T$2:$T$501, MATCH($B50, Ingredients_DB!$B$2:$B$501,0)),0))","v":""},{"$f":"IF($B50=\"\",\"\",IFERROR(INDEX(Ingredients_DB!$U$2:$U$501, MATCH($B50, Ingredients_DB!$B$2:$B$501,0)),0))","v":""},{"$f":"IF($B50=\"\",\"\",IFERROR(INDEX(Ingredients_DB!$V$2:$V$501, MATCH($B50, Ingredients_DB!$B$2:$B$501,0)),0))","v":""},{"$f":"IF($B50=\"\",\"\",IFERROR(INDEX(Ingredients_DB!$W$2:$W$501, MATCH($B50, Ingredients_DB!$B$2:$B$501,0)),0))","v":""},{"$f":"IF($B50=\"\",\"\",IFERROR(INDEX(Ingredients_DB!$X$2:$X$501, MATCH($B50, Ingredients_DB!$B$2:$B$501,0)),0))","v":""},{"$f":"IF($B50=\"\",\"\",IFERROR(INDEX(Ingredients_DB!$Y$2:$Y$501, MATCH($B50, Ingredients_DB!$B$2:$B$501,0)),0))","v":""},{"$f":"IF($B50=\"\",\"\",IFERROR(INDEX(Ingredients_DB!$Z$2:$Z$501, MATCH($B50, Ingredients_DB!$B$2:$B$501,0)),0))","v":""}]

{"sheet":"Ingredients_DB","index":2,"n_rows":501,"n_cols":26,"rows_kept":501}
["ID","Ingredient","Category","Supplier","PackCost","PackSize","PackUOM","BaseType","BaseUnit","PackBaseQty","UnitCostPerBase","Notes","Milk","Egg","Fish","Shellfish","Molluscs","Peanuts","TreeNuts","Wheat/Gluten","Soy","Sesame","Mustard","Celery","Lupin","Sulphites"]
["ING001","Beef mince","Meat","Local Butcher",{"v":45,"d":"$45.00"},{"v":5,"d":"5.00"},"kg","Weight","g",{"$f":"IF($B2=\"\",\"\",IF($H2=\"Weight\",$F2*VLOOKUP(\"Weight|\"&$G2,UOM_Conversions!$A$2:$E$50,4,FALSE),IF($H2=\"Volume\",$F2*VLOOKUP(\"Volume|\"&$G2,UOM_Conversions!$A$2:$E$50,4,FALSE),$F2*VLOOKUP(\"Each|\"&$G2,UOM_Conversions!$A$2:$E$50,4,FALSE))))","v":{"v":5000,"d":"5000.00"}},{"$f":"IF($B2=\"\",\"\",IFERROR($E2/$J2,0))","v":{"v":0.009,"d":"$0.01"}},null,0,0,0,0,0,0,0,0,0,0,0,0,0,0]
["ING002","Burger bun","Bakery","Bakery Co",{"v":18,"d":"$18.00"},{"v":24,"d":"24.00"},"each","Each","each",{"$f":"IF($B3=\"\",\"\",IF($H3=\"Weight\",$F3*VLOOKUP(\"Weight|\"&$G3,UOM_Conversions!$A$2:$E$50,4,FALSE),IF($H3=\"Volume\",$F3*VLOOKUP(\"Volume|\"&$G3,UOM_Conversions!$A$2:$E$50,4,FALSE),$F3*VLOOKUP(\"Each|\"&$G3,UOM_Conversions!$A$2:$E$50,4,FALSE))))","v":{"v":24,"d":"24.00"}},{"v":0.75,"d":"$0.75"},null,0,0,0,0,0,0,0,1,0,0,0,0,0,0]
["ING003","Cheddar cheese","Dairy","Dairy Supplier",{"v":22,"d":"$22.00"},{"v":2,"d":"2.00"},"kg","Weight","g",{"$f":"IF($B4=\"\",\"\",IF($H4=\"Weight\",$F4*VLOOKUP(\"Weight|\"&$G4,UOM_Conversions!$A$2:$E$50,4,FALSE),IF($H4=\"Volume\",$F4*VLOOKUP(\"Volume|\"&$G4,UOM_Conversions!$A$2:$E$50,4,FALSE),$F4*VLOOKUP(\"Each|\"&$G4,UOM_Conversions!$A$2:$E$50,4,FALSE))))","v":{"v":2000,"d":"2000.00"}},{"v":0.011,"d":"$0.01"},null,1,0,0,0,0,0,0,0,0,0,0,0,0,0]
["ING004","Lettuce","Produce","Fresh Farms",{"v":8,"d":"$8.00"},{"v":1,"d":"1.00"},"kg","Weight","g",{"$f":"IF($B5=\"\",\"\",IF($H5=\"Weight\",$F5*VLOOKUP(\"Weight|\"&$G5,UOM_Conversions!$A$2:$E$50,4,FALSE),IF($H5=\"Volume\",$F5*VLOOKUP(\"Volume|\"&$G5,UOM_Conversions!$A$2:$E$50,4,FALSE),$F5*VLOOKUP(\"Each|\"&$G5,UOM_Conversions!$A$2:$E$50,4,FALSE))))","v":{"v":1000,"d":"1000.00"}},{"v":0.008,"d":"$0.01"},null,0,0,0,0,0,0,0,0,0,0,0,0,0,0]
["ING005","Ketchup","Condiments","Foodservice",{"v":12,"d":"$12.00"},{"v":3,"d":"3.00"},"kg","Weight","g",{"$f":"IF($B6=\"\",\"\",IF($H6=\"Weight\",$F6*VLOOKUP(\"Weight|\"&$G6,UOM_Conversions!$A$2:$E$50,4,FALSE),IF($H6=\"Volume\",$F6*VLOOKUP(\"Volume|\"&$G6,UOM_Conversions!$A$2:$E$50,4,FALSE),$F6*VLOOKUP(\"Each|\"&$G6,UOM_Conversions!$A$2:$E$50,4,FALSE))))","v":{"v":3000,"d":"3000.00"}},{"v":0.004,"d":"$0.00"},null,0,0,0,0,0,0,0,0,0,0,0,0,0,0]
["ING006","Mayonnaise","Condiments","Foodservice",{"v":15,"d":"$15.00"},{"v":2,"d":"2.00"},"kg","Weight","g",{"$f":"IF($B7=\"\",\"\",IF($H7=\"Weight\",$F7*VLOOKUP(\"Weight|\"&$G7,UOM_Conversions!$A$2:$E$50,4,FALSE),IF($H7=\"Volume\",$F7*VLOOKUP(\"Volume|\"&$G7,UOM_Conversions!$A$2:$E$50,4,FALSE),$F7*VLOOKUP(\"Each|\"&$G7,UOM_Conversions!$A$2:$E$50,4,FALSE))))","v":{"v":2000,"d":"2000.00"}},{"v":0.0075,"d":"$0.01"},null,0,1,0,0,0,0,0,0,1,0,0,0,0,0]
["ING007","French fries (frozen)","Frozen","Foodservice",{"v":28,"d":"$28.00"},{"v":10,"d":"10.00"},"kg","Weight","g",{"$f":"IF($B8=\"\",\"\",IF($H8=\"Weight\",$F8*VLOOKUP(\"Weight|\"&$G8,UOM_Conversions!$A$2:$E$50,4,FALSE),IF($H8=\"Volume\",$F8*VLOOKUP(\"Volume|\"&$G8,UOM_Conversions!$A$2:$E$50,4,FALSE),$F8*VLOOKUP(\"Each|\"&$G8,UOM_Conversions!$A$2:$E$50,4,FALSE))))","v":{"v":10000,"d":"10000.00"}},{"v":2.8E-3,"d":"$0.00"},null,0,0,0,0,0,0,0,0,0,0,0,0,0,0]
["ING008","Sesame seeds","Dry goods","Foodservice",{"v":10,"d":"$10.00"},{"v":1,"d":"1.00"},"kg","Weight","g",{"$f":"IF($B9=\"\",\"\",IF($H9=\"Weight\",$F9*VLOOKUP(\"Weight|\"&$G9,UOM_Conversions!$A$2:$E$50,4,FALSE),IF($H9=\"Volume\",$F9*VLOOKUP(\"Volume|\"&$G9,UOM_Conversions!$A$2:$E$50,4,FALSE),$F9*VLOOKUP(\"Each|\"&$G9,UOM_Conversions!$A$2:$E$50,4,FALSE))))","v":{"v":1000,"d":"1000.00"}},{"v":0.01,"d":"$0.01"},null,0,0,0,0,0,0,0,0,0,1,0,0,0,0]
[{"$nulls":9},{"$f":"IF($B10=\"\",\"\",IF($H10=\"Weight\",$F10*VLOOKUP(\"Weight|\"&$G10,UOM_Conversions!$A$2:$E$50,4,FALSE),IF($H10=\"Volume\",$F10*VLOOKUP(\"Volume|\"&$G10,UOM_Conversions!$A$2:$E$50,4,FALSE),$F10*VLOOKUP(\"Each|\"&$G10,UOM_Conversions!$A$2:$E$50,4,FALSE))))","v":""},""]
[{"$nulls":9},{"$f":"IF($B11=\"\",\"\",IF($H11=\"Weight\",$F11*VLOOKUP(\"Weight|\"&$G11,UOM_Conversions!$A$2:$E$50,4,FALSE),IF($H11=\"Volume\",$F11*VLOOKUP(\"Volume|\"&$G11,UOM_Conversions!$A$2:$E$50,4,FALSE),$F11*VLOOKUP(\"Each|\"&$G11,UOM_Conversions!$A$2:$E$50,4,FALSE))))","v":""},""]
[{"$nulls":9},{"$f":"IF($B12=\"\",\"\",IF($H12=\"Weight\",$F12*VLOOKUP(\"Weight|\"&$G12,UOM_Conversions!$A$2:$E$50,4,FALSE),IF($H12=\"Volume\",$F12*VLOOKUP(\"Volume|\"&$G12,UOM_Conversions!$A$2:$E$50,4,FALSE),$F12*VLOOKUP(\"Each|\"&$G12,UOM_Conversions!$A$2:$E$50,4,FALSE))))","v":""},""]
[{"$nulls":9},{"$f":"IF($B13=\"\",\"\",IF($H13=\"Weight\",$F13*VLOOKUP(\"Weight|\"&$G13,UOM_Conversions!$A$2:$E$50,4,FALSE),IF($H13=\"Volume\",$F13*VLOOKUP(\"Volume|\"&$G13,UOM_Conversions!$A$2:$E$50,4,FALSE),$F13*VLOOKUP(\"Each|\"&$G13,UOM_Conversions!$A$2:$E$50,4,FALSE))))","v":""},""]
[{"$nulls":9},{"$f":"IF($B14=\"\",\"\",IF($H14=\"Weight\",$F14*VLOOKUP(\"Weight|\"&$G14,UOM_Conversions!$A$2:$E$50,4,FALSE),IF($H14=\"Volume\",$F14*VLOOKUP(\"Volume|\"&$G14,UOM_Conversions!$A$2:$E$50,4,FALSE),$F14*VLOOKUP(\"Each|\"&$G14,UOM_Conversions!$A$2:$E$50,4,FALSE))))","v":""},""]
[{"$nulls":9},{"$f":"IF($B15=\"\",\"\",IF($H15=\"Weight\",$F15*VLOOKUP(\"Weight|\"&$G15,UOM_Conversions!$A$2:$E$50,4,FALSE),IF($H15=\"Volume\",$F15*VLOOKUP(\"Volume|\"&$G15,UOM_Conversions!$A$2:$E$50,4,FALSE),$F15*VLOOKUP(\"Each|\"&$G15,UOM_Conversions!$A$2:$E$50,4,FALSE))))","v":""},""]
[{"$nulls":9},{"$f":"IF($B16=\"\",\"\",IF($H16=\"Weight\",$F16*VLOOKUP(\"Weight|\"&$G16,UOM_Conversions!$A$2:$E$50,4,FALSE),IF($H16=\"Volume\",$F16*VLOOKUP(\"Volume|\"&$G16,UOM_Conversions!$A$2:$E$50,4,FALSE),$F16*VLOOKUP(\"Each|\"&$G16,UOM_Conversions!$A$2:$E$50,4,FALSE))))","v":""},""]
[{"$nulls":9},{"$f":"IF($B17=\"\",\"\",IF($H17=\"Weight\",$F17*VLOOKUP(\"Weight|\"&$G17,UOM_Conversions!$A$2:$E$50,4,FALSE),IF($H17=\"Volume\",$F17*VLOOKUP(\"Volume|\"&$G17,UOM_Conversions!$A$2:$E$50,4,FALSE),$F17*VLOOKUP(\"Each|\"&$G17,UOM_Conversions!$A$2:$E$50,4,FALSE))))","v":""},""]
[{"$nulls":9},{"$f":"IF($B18=\"\",\"\",IF($H18=\"Weight\",$F18*VLOOKUP(\"Weight|\"&$G18,UOM_Conversions!$A$2:$E$50,4,FALSE),IF($H18=\"Volume\",$F18*VLOOKUP(\"Volume|\"&$G18,UOM_Conversions!$A$2:$E$50,4,FALSE),$F18*VLOOKUP(\"Each|\"&$G18,UOM_Conversions!$A$2:$E$50,4,FALSE))))","v":""},""]
[{"$nulls":9},{"$f":"IF($B19=\"\",\"\",IF($H19=\"Weight\",$F19*VLOOKUP(\"Weight|\"&$G19,UOM_Conversions!$A$2:$E$50,4,FALSE),IF($H19=\"Volume\",$F19*VLOOKUP(\"Volume|\"&$G19,UOM_Conversions!$A$2:$E$50,4,FALSE),$F19*VLOOKUP(\"Each|\"&$G19,UOM_Conversions!$A$2:$E$50,4,FALSE))))","v":""},""]
[{"$nulls":9},{"$f":"IF($B20=\"\",\"\",IF($H20=\"Weight\",$F20*VLOOKUP(\"Weight|\"&$G20,UOM_Conversions!$A$2:$E$50,4,FALSE),IF($H20=\"Volume\",$F20*VLOOKUP(\"Volume|\"&$G20,UOM_Conversions!$A$2:$E$50,4,FALSE),$F20*VLOOKUP(\"Each|\"&$G20,UOM_Conversions!$A$2:$E$50,4,FALSE))))","v":""},""]
[{"$nulls":9},{"$f":"IF($B21=\"\",\"\",IF($H21=\"Weight\",$F21*VLOOKUP(\"Weight|\"&$G21,UOM_Conversions!$A$2:$E$50,4,FALSE),IF($H21=\"Volume\",$F21*VLOOKUP(\"Volume|\"&$G21,UOM_Conversions!$A$2:$E$50,4,FALSE),$F21*VLOOKUP(\"Each|\"&$G21,UOM_Conversions!$A$2:$E$50,4,FALSE))))","v":""},""]
[{"$nulls":9},{"$f":"IF($B22=\"\",\"\",IF($H22=\"Weight\",$F22*VLOOKUP(\"Weight|\"&$G22,UOM_Conversions!$A$2:$E$50,4,FALSE),IF($H22=\"Volume\",$F22*VLOOKUP(\"Volume|\"&$G22,UOM_Conversions!$A$2:$E$50,4,FALSE),$F22*VLOOKUP(\"Each|\"&$G22,UOM_Conversions!$A$2:$E$50,4,FALSE))))","v":""},""]
[{"$nulls":9},{"$f":"IF($B23=\"\",\"\",IF($H23=\"Weight\",$F23*VLOOKUP(\"Weight|\"&$G23,UOM_Conversions!$A$2:$E$50,4,FALSE),IF($H23=\"Volume\",$F23*VLOOKUP(\"Volume|\"&$G23,UOM_Conversions!$A$2:$E$50,4,FALSE),$F23*VLOOKUP(\"Each|\"&$G23,UOM_Conversions!$A$2:$E$50,4,FALSE))))","v":""},""]
[{"$nulls":9},{"$f":"IF($B24=\"\",\"\",IF($H24=\"Weight\",$F24*VLOOKUP(\"Weight|\"&$G24,UOM_Conversions!$A$2:$E$50,4,FALSE),IF($H24=\"Volume\",$F24*VLOOKUP(\"Volume|\"&$G24,UOM_Conversions!$A$2:$E$50,4,FALSE),$F24*VLOOKUP(\"Each|\"&$G24,UOM_Conversions!$A$2:$E$50,4,FALSE))))","v":""},""]
[{"$nulls":9},{"$f":"IF($B25=\"\",\"\",IF($H25=\"Weight\",$F25*VLOOKUP(\"Weight|\"&$G25,UOM_Conversions!$A$2:$E$50,4,FALSE),IF($H25=\"Volume\",$F25*VLOOKUP(\"Volume|\"&$G25,UOM_Conversions!$A$2:$E$50,4,FALSE),$F25*VLOOKUP(\"Each|\"&$G25,UOM_Conversions!$A$2:$E$50,4,FALSE))))","v":""},""]
[{"$nulls":9},{"$f":"IF($B26=\"\",\"\",IF($H26=\"Weight\",$F26*VLOOKUP(\"Weight|\"&$G26,UOM_Conversions!$A$2:$E$50,4,FALSE),IF($H26=\"Volume\",$F26*VLOOKUP(\"Volume|\"&$G26,UOM_Conversions!$A$2:$E$50,4,FALSE),$F26*VLOOKUP(\"Each|\"&$G26,UOM_Conversions!$A$2:$E$50,4,FALSE))))","v":""},""]
[{"$nulls":9},{"$f":"IF($B27=\"\",\"\",IF($H27=\"Weight\",$F27*VLOOKUP(\"Weight|\"&$G27,UOM_Conversions!$A$2:$E$50,4,FALSE),IF($H27=\"Volume\",$F27*VLOOKUP(\"Volume|\"&$G27,UOM_Conversions!$A$2:$E$50,4,FALSE),$F27*VLOOKUP(\"Each|\"&$G27,UOM_Conversions!$A$2:$E$50,4,FALSE))))","v":""},""]
[{"$nulls":9},{"$f":"IF($B28=\"\",\"\",IF($H28=\"Weight\",$F28*VLOOKUP(\"Weight|\"&$G28,UOM_Conversions!$A$2:$E$50,4,FALSE),IF($H28=\"Volume\",$F28*VLOOKUP(\"Volume|\"&$G28,UOM_Conversions!$A$2:$E$50,4,FALSE),$F28*VLOOKUP(\"Each|\"&$G28,UOM_Conversions!$A$2:$E$50,4,FALSE))))","v":""},""]
[{"$nulls":9},{"$f":"IF($B29=\"\",\"\",IF($H29=\"Weight\",$F29*VLOOKUP(\"Weight|\"&$G29,UOM_Conversions!$A$2:$E$50,4,FALSE),IF($H29=\"Volume\",$F29*VLOOKUP(\"Volume|\"&$G29,UOM_Conversions!$A$2:$E$50,4,FALSE),$F29*VLOOKUP(\"Each|\"&$G29,UOM_Conversions!$A$2:$E$50,4,FALSE))))","v":""},""]
[{"$nulls":9},{"$f":"IF($B30=\"\",\"\",IF($H30=\"Weight\",$F30*VLOOKUP(\"Weight|\"&$G30,UOM_Conversions!$A$2:$E$50,4,FALSE),IF($H30=\"Volume\",$F30*VLOOKUP(\"Volume|\"&$G30,UOM_Conversions!$A$2:$E$50,4,FALSE),$F30*VLOOKUP(\"Each|\"&$G30,UOM_Conversions!$A$2:$E$50,4,FALSE))))","v":""},""]
[{"$nulls":9},{"$f":"IF($B31=\"\",\"\",IF($H31=\"Weight\",$F31*VLOOKUP(\"Weight|\"&$G31,UOM_Conversions!$A$2:$E$50,4,FALSE),IF($H31=\"Volume\",$F31*VLOOKUP(\"Volume|\"&$G31,UOM_Conversions!$A$2:$E$50,4,FALSE),$F31*VLOOKUP(\"Each|\"&$G31,UOM_Conversions!$A$2:$E$50,4,FALSE))))","v":""},""]
[{"$nulls":9},{"$f":"IF($B32=\"\",\"\",IF($H32=\"Weight\",$F32*VLOOKUP(\"Weight|\"&$G32,UOM_Conversions!$A$2:$E$50,4,FALSE),IF($H32=\"Volume\",$F32*VLOOKUP(\"Volume|\"&$G32,UOM_Conversions!$A$2:$E$50,4,FALSE),$F32*VLOOKUP(\"Each|\"&$G32,UOM_Conversions!$A$2:$E$50,4,FALSE))))","v":""},""]
[{"$nulls":9},{"$f":"IF($B33=\"\",\"\",IF($H33=\"Weight\",$F33*VLOOKUP(\"Weight|\"&$G33,UOM_Conversions!$A$2:$E$50,4,FALSE),IF($H33=\"Volume\",$F33*VLOOKUP(\"Volume|\"&$G33,UOM_Conversions!$A$2:$E$50,4,FALSE),$F33*VLOOKUP(\"Each|\"&$G33,UOM_Conversions!$A$2:$E$50,4,FALSE))))","v":""},""]
[{"$nulls":9},{"$f":"IF($B34=\"\",\"\",IF($H34=\"Weight\",$F34*VLOOKUP(\"Weight|\"&$G34,UOM_Conversions!$A$2:$E$50,4,FALSE),IF($H34=\"Volume\",$F34*VLOOKUP(\"Volume|\"&$G34,UOM_Conversions!$A$2:$E$50,4,FALSE),$F34*VLOOKUP(\"Each|\"&$G34,UOM_Conversions!$A$2:$E$50,4,FALSE))))","v":""},""]
[{"$nulls":9},{"$f":"IF($B35=\"\",\"\",IF($H35=\"Weight\",$F35*VLOOKUP(\"Weight|\"&$G35,UOM_Conversions!$A$2:$E$50,4,FALSE),IF($H35=\"Volume\",$F35*VLOOKUP(\"Volume|\"&$G35,UOM_Conversions!$A$2:$E$50,4,FALSE),$F35*VLOOKUP(\"Each|\"&$G35,UOM_Conversions!$A$2:$E$50,4,FALSE))))","v":""},""]
[{"$nulls":9},{"$f":"IF($B36=\"\",\"\",IF($H36=\"Weight\",$F36*VLOOKUP(\"Weight|\"&$G36,UOM_Conversions!$A$2:$E$50,4,FALSE),IF($H36=\"Volume\",$F36*VLOOKUP(\"Volume|\"&$G36,UOM_Conversions!$A$2:$E$50,4,FALSE),$F36*VLOOKUP(\"Each|\"&$G36,UOM_Conversions!$A$2:$E$50,4,FALSE))))","v":""},""]
[{"$nulls":9},{"$f":"IF($B37=\"\",\"\",IF($H37=\"Weight\",$F37*VLOOKUP(\"Weight|\"&$G37,UOM_Conversions!$A$2:$E$50,4,FALSE),IF($H37=\"Volume\",$F37*VLOOKUP(\"Volume|\"&$G37,UOM_Conversions!$A$2:$E$50,4,FALSE),$F37*VLOOKUP(\"Each|\"&$G37,UOM_Conversions!$A$2:$E$50,4,FALSE))))","v":""},""]
[{"$nulls":9},{"$f":"IF($B38=\"\",\"\",IF($H38=\"Weight\",$F38*VLOOKUP(\"Weight|\"&$G38,UOM_Conversions!$A$2:$E$50,4,FALSE),IF($H38=\"Volume\",$F38*VLOOKUP(\"Volume|\"&$G38,UOM_Conversions!$A$2:$E$50,4,FALSE),$F38*VLOOKUP(\"Each|\"&$G38,UOM_Conversions!$A$2:$E$50,4,FALSE))))","v":""},""]
[{"$nulls":9},{"$f":"IF($B39=\"\",\"\",IF($H39=\"Weight\",$F39*VLOOKUP(\"Weight|\"&$G39,UOM_Conversions!$A$2:$E$50,4,FALSE),IF($H39=\"Volume\",$F39*VLOOKUP(\"Volume|\"&$G39,UOM_Conversions!$A$2:$E$50,4,FALSE),$F39*VLOOKUP(\"Each|\"&$G39,UOM_Conversions!$A$2:$E$50,4,FALSE))))","v":""},""]
[{"$nulls":9},{"$f":"IF($B40=\"\",\"\",IF($H40=\"Weight\",$F40*VLOOKUP(\"Weight|\"&$G40,UOM_Conversions!$A$2:$E$50,4,FALSE),IF($H40=\"Volume\",$F40*VLOOKUP(\"Volume|\"&$G40,UOM_Conversions!$A$2:$E$50,4,FALSE),$F40*VLOOKUP(\"Each|\"&$G40,UOM_Conversions!$A$2:$E$50,4,FALSE))))","v":""},""]
[{"$nulls":9},{"$f":"IF($B41=\"\",\"\",IF($H41=\"Weight\",$F41*VLOOKUP(\"Weight|\"&$G41,UOM_Conversions!$A$2:$E$50,4,FALSE),IF($H41=\"Volume\",$F41*VLOOKUP(\"Volume|\"&$G41,UOM_Conversions!$A$2:$E$50,4,FALSE),$F41*VLOOKUP(\"Each|\"&$G41,UOM_Conversions!$A$2:$E$50,4,FALSE))))","v":""},""]
[{"$nulls":9},{"$f":"IF($B42=\"\",\"\",IF($H42=\"Weight\",$F42*VLOOKUP(\"Weight|\"&$G42,UOM_Conversions!$A$2:$E$50,4,FALSE),IF($H42=\"Volume\",$F42*VLOOKUP(\"Volume|\"&$G42,UOM_Conversions!$A$2:$E$50,4,FALSE),$F42*VLOOKUP(\"Each|\"&$G42,UOM_Conversions!$A$2:$E$50,4,FALSE))))","v":""},""]
[{"$nulls":9},{"$f":"IF($B43=\"\",\"\",IF($H43=\"Weight\",$F43*VLOOKUP(\"Weight|\"&$G43,UOM_Conversions!$A$2:$E$50,4,FALSE),IF($H43=\"Volume\",$F43*VLOOKUP(\"Volume|\"&$G43,UOM_Conversions!$A$2:$E$50,4,FALSE),$F43*VLOOKUP(\"Each|\"&$G43,UOM_Conversions!$A$2:$E$50,4,FALSE))))","v":""},""]
[{"$nulls":9},{"$f":"IF($B44=\"\",\"\",IF($H44=\"Weight\",$F44*VLOOKUP(\"Weight|\"&$G44,UOM_Conversions!$A$2:$E$50,4,FALSE),IF($H44=\"Volume\",$F44*VLOOKUP(\"Volume|\"&$G44,UOM_Conversions!$A$2:$E$50,4,FALSE),$F44*VLOOKUP(\"Each|\"&$G44,UOM_Conversions!$A$2:$E$50,4,FALSE))))","v":""},""]
[{"$nulls":9},{"$f":"IF($B45=\"\",\"\",IF($H45=\"Weight\",$F45*VLOOKUP(\"Weight|\"&$G45,UOM_Conversions!$A$2:$E$50,4,FALSE),IF($H45=\"Volume\",$F45*VLOOKUP(\"Volume|\"&$G45,UOM_Conversions!$A$2:$E$50,4,FALSE),$F45*VLOOKUP(\"Each|\"&$G45,UOM_Conversions!$A$2:$E$50,4,FALSE))))","v":""},""]
[{"$nulls":9},{"$f":"IF($B46=\"\",\"\",IF($H46=\"Weight\",$F46*VLOOKUP(\"Weight|\"&$G46,UOM_Conversions!$A$2:$E$50,4,FALSE),IF($H46=\"Volume\",$F46*VLOOKUP(\"Volume|\"&$G46,UOM_Conversions!$A$2:$E$50,4,FALSE),$F46*VLOOKUP(\"Each|\"&$G46,UOM_Conversions!$A$2:$E$50,4,FALSE))))","v":""},""]
[{"$nulls":9},{"$f":"IF($B47=\"\",\"\",IF($H47=\"Weight\",$F47*VLOOKUP(\"Weight|\"&$G47,UOM_Conversions!$A$2:$E$50,4,FALSE),IF($H47=\"Volume\",$F47*VLOOKUP(\"Volume|\"&$G47,UOM_Conversions!$A$2:$E$50,4,FALSE),$F47*VLOOKUP(\"Each|\"&$G47,UOM_Conversions!$A$2:$E$50,4,FALSE))))","v":""},""]
[{"$nulls":9},{"$f":"IF($B48=\"\",\"\",IF($H48=\"Weight\",$F48*VLOOKUP(\"Weight|\"&$G48,UOM_Conversions!$A$2:$E$50,4,FALSE),IF($H48=\"Volume\",$F48*VLOOKUP(\"Volume|\"&$G48,UOM_Conversions!$A$2:$E$50,4,FALSE),$F48*VLOOKUP(\"Each|\"&$G48,UOM_Conversions!$A$2:$E$50,4,FALSE))))","v":""},""]
[{"$nulls":9},{"$f":"IF($B49=\"\",\"\",IF($H49=\"Weight\",$F49*VLOOKUP(\"Weight|\"&$G49,UOM_Conversions!$A$2:$E$50,4,FALSE),IF($H49=\"Volume\",$F49*VLOOKUP(\"Volume|\"&$G49,UOM_Conversions!$A$2:$E$50,4,FALSE),$F49*VLOOKUP(\"Each|\"&$G49,UOM_Conversions!$A$2:$E$50,4,FALSE))))","v":""},""]
[{"$nulls":9},{"$f":"IF($B50=\"\",\"\",IF($H50=\"Weight\",$F50*VLOOKUP(\"Weight|\"&$G50,UOM_Conversions!$A$2:$E$50,4,FALSE),IF($H50=\"Volume\",$F50*VLOOKUP(\"Volume|\"&$G50,UOM_Conversions!$A$2:$E$50,4,FALSE),$F50*VLOOKUP(\"Each|\"&$G50,UOM_Conversions!$A$2:$E$50,4,FALSE))))","v":""},""]
[{"$nulls":9},{"$f":"IF($B51=\"\",\"\",IF($H51=\"Weight\",$F51*VLOOKUP(\"Weight|\"&$G51,UOM_Conversions!$A$2:$E$50,4,FALSE),IF($H51=\"Volume\",$F51*VLOOKUP(\"Volume|\"&$G51,UOM_Conversions!$A$2:$E$50,4,FALSE),$F51*VLOOKUP(\"Each|\"&$G51,UOM_Conversions!$A$2:$E$50,4,FALSE))))","v":""},""]
[{"$nulls":9},{"$f":"IF($B52=\"\",\"\",IF($H52=\"Weight\",$F52*VLOOKUP(\"Weight|\"&$G52,UOM_Conversions!$A$2:$E$50,4,FALSE),IF($H52=\"Volume\",$F52*VLOOKUP(\"Volume|\"&$G52,UOM_Conversions!$A$2:$E$50,4,FALSE),$F52*VLOOKUP(\"Each|\"&$G52,UOM_Conversions!$A$2:$E$50,4,FALSE))))","v":""},""]
[{"$nulls":9},{"$f":"IF($B53=\"\",\"\",IF($H53=\"Weight\",$F53*VLOOKUP(\"Weight|\"&$G53,UOM_Conversions!$A$2:$E$50,4,FALSE),IF($H53=\"Volume\",$F53*VLOOKUP(\"Volume|\"&$G53,UOM_Conversions!$A$2:$E$50,4,FALSE),$F53*VLOOKUP(\"Each|\"&$G53,UOM_Conversions!$A$2:$E$50,4,FALSE))))","v":""},""]
[{"$nulls":9},{"$f":"IF($B54=\"\",\"\",IF($H54=\"Weight\",$F54*VLOOKUP(\"Weight|\"&$G54,UOM_Conversions!$A$2:$E$50,4,FALSE),IF($H54=\"Volume\",$F54*VLOOKUP(\"Volume|\"&$G54,UOM_Conversions!$A$2:$E$50,4,FALSE),$F54*VLOOKUP(\"Each|\"&$G54,UOM_Conversions!$A$2:$E$50,4,FALSE))))","v":""},""]
[{"$nulls":9},{"$f":"IF($B55=\"\",\"\",IF($H55=\"Weight\",$F55*VLOOKUP(\"Weight|\"&$G55,UOM_Conversions!$A$2:$E$50,4,FALSE),IF($H55=\"Volume\",$F55*VLOOKUP(\"Volume|\"&$G55,UOM_Conversions!$A$2:$E$50,4,FALSE),$F55*VLOOKUP(\"Each|\"&$G55,UOM_Conversions!$A$2:$E$50,4,FALSE))))","v":""},""]
[{"$nulls":9},{"$f":"IF($B56=\"\",\"\",IF($H56=\"Weight\",$F56*VLOOKUP(\"Weight|\"&$G56,UOM_Conversions!$A$2:$E$50,4,FALSE),IF($H56=\"Volume\",$F56*VLOOKUP(\"Volume|\"&$G56,UOM_Conversions!$A$2:$E$50,4,FALSE),$F56*VLOOKUP(\"Each|\"&$G56,UOM_Conversions!$A$2:$E$50,4,FALSE))))","v":""},""]
[{"$nulls":9},{"$f":"IF($B57=\"\",\"\",IF($H57=\"Weight\",$F57*VLOOKUP(\"Weight|\"&$G57,UOM_Conversions!$A$2:$E$50,4,FALSE),IF($H57=\"Volume\",$F57*VLOOKUP(\"Volume|\"&$G57,UOM_Conversions!$A$2:$E$50,4,FALSE),$F57*VLOOKUP(\"Each|\"&$G57,UOM_Conversions!$A$2:$E$50,4,FALSE))))","v":""},""]
[{"$nulls":9},{"$f":"IF($B58=\"\",\"\",IF($H58=\"Weight\",$F58*VLOOKUP(\"Weight|\"&$G58,UOM_Conversions!$A$2:$E$50,4,FALSE),IF($H58=\"Volume\",$F58*VLOOKUP(\"Volume|\"&$G58,UOM_Conversions!$A$2:$E$50,4,FALSE),$F58*VLOOKUP(\"Each|\"&$G58,UOM_Conversions!$A$2:$E$50,4,FALSE))))","v":""},""]
[{"$nulls":9},{"$f":"IF($B59=\"\",\"\",IF($H59=\"Weight\",$F59*VLOOKUP(\"Weight|\"&$G59,UOM_Conversions!$A$2:$E$50,4,FALSE),IF($H59=\"Volume\",$F59*VLOOKUP(\"Volume|\"&$G59,UOM_Conversions!$A$2:$E$50,4,FALSE),$F59*VLOOKUP(\"Each|\"&$G59,UOM_Conversions!$A$2:$E$50,4,FALSE))))","v":""},""]
[{"$nulls":9},{"$f":"IF($B60=\"\",\"\",IF($H60=\"Weight\",$F60*VLOOKUP(\"Weight|\"&$G60,UOM_Conversions!$A$2:$E$50,4,FALSE),IF($H60=\"Volume\",$F60*VLOOKUP(\"Volume|\"&$G60,UOM_Conversions!$A$2:$E$50,4,FALSE),$F60*VLOOKUP(\"Each|\"&$G60,UOM_Conversions!$A$2:$E$50,4,FALSE))))","v":""},""]
[{"$nulls":9},{"$f":"IF($B61=\"\",\"\",IF($H61=\"Weight\",$F61*VLOOKUP(\"Weight|\"&$G61,UOM_Conversions!$A$2:$E$50,4,FALSE),IF($H61=\"Volume\",$F61*VLOOKUP(\"Volume|\"&$G61,UOM_Conversions!$A$2:$E$50,4,FALSE),$F61*VLOOKUP(\"Each|\"&$G61,UOM_Conversions!$A$2:$E$50,4,FALSE))))","v":""},""]
[{"$nulls":9},{"$f":"IF($B62=\"\",\"\",IF($H62=\"Weight\",$F62*VLOOKUP(\"Weight|\"&$G62,UOM_Conversions!$A$2:$E$50,4,FALSE),IF($H62=\"Volume\",$F62*VLOOKUP(\"Volume|\"&$G62,UOM_Conversions!$A$2:$E$50,4,FALSE),$F62*VLOOKUP(\"Each|\"&$G62,UOM_Conversions!$A$2:$E$50,4,FALSE))))","v":""},""]
[{"$nulls":9},{"$f":"IF($B63=\"\",\"\",IF($H63=\"Weight\",$F63*VLOOKUP(\"Weight|\"&$G63,UOM_Conversions!$A$2:$E$50,4,FALSE),IF($H63=\"Volume\",$F63*VLOOKUP(\"Volume|\"&$G63,UOM_Conversions!$A$2:$E$50,4,FALSE),$F63*VLOOKUP(\"Each|\"&$G63,UOM_Conversions!$A$2:$E$50,4,FALSE))))","v":""},""]
[{"$nulls":9},{"$f":"IF($B64=\"\",\"\",IF($H64=\"Weight\",$F64*VLOOKUP(\"Weight|\"&$G64,UOM_Conversions!$A$2:$E$50,4,FALSE),IF($H64=\"Volume\",$F64*VLOOKUP(\"Volume|\"&$G64,UOM_Conversions!$A$2:$E$50,4,FALSE),$F64*VLOOKUP(\"Each|\"&$G64,UOM_Conversions!$A$2:$E$50,4,FALSE))))","v":""},""]
[{"$nulls":9},{"$f":"IF($B65=\"\",\"\",IF($H65=\"Weight\",$F65*VLOOKUP(\"Weight|\"&$G65,UOM_Conversions!$A$2:$E$50,4,FALSE),IF($H65=\"Volume\",$F65*VLOOKUP(\"Volume|\"&$G65,UOM_Conversions!$A$2:$E$50,4,FALSE),$F65*VLOOKUP(\"Each|\"&$G65,UOM_Conversions!$A$2:$E$50,4,FALSE))))","v":""},""]
[{"$nulls":9},{"$f":"IF($B66=\"\",\"\",IF($H66=\"Weight\",$F66*VLOOKUP(\"Weight|\"&$G66,UOM_Conversions!$A$2:$E$50,4,FALSE),IF($H66=\"Volume\",$F66*VLOOKUP(\"Volume|\"&$G66,UOM_Conversions!$A$2:$E$50,4,FALSE),$F66*VLOOKUP(\"Each|\"&$G66,UOM_Conversions!$A$2:$E$50,4,FALSE))))","v":""},{"$f":"IF($B66=\"\",\"\",IFERROR($E66/$J66,0))","v":""}]
[{"$nulls":9},{"$f":"IF($B67=\"\",\"\",IF($H67=\"Weight\",$F67*VLOOKUP(\"Weight|\"&$G67,UOM_Conversions!$A$2:$E$50,4,FALSE),IF($H67=\"Volume\",$F67*VLOOKUP(\"Volume|\"&$G67,UOM_Conversions!$A$2:$E$50,4,FALSE),$F67*VLOOKUP(\"Each|\"&$G67,UOM_Conversions!$A$2:$E$50,4,FALSE))))","v":""},""]
[{"$nulls":9},{"$f":"IF($B68=\"\",\"\",IF($H68=\"Weight\",$F68*VLOOKUP(\"Weight|\"&$G68,UOM_Conversions!$A$2:$E$50,4,FALSE),IF($H68=\"Volume\",$F68*VLOOKUP(\"Volume|\"&$G68,UOM_Conversions!$A$2:$E$50,4,FALSE),$F68*VLOOKUP(\"Each|\"&$G68,UOM_Conversions!$A$2:$E$50,4,FALSE))))","v":""},""]
[{"$nulls":9},{"$f":"IF($B69=\"\",\"\",IF($H69=\"Weight\",$F69*VLOOKUP(\"Weight|\"&$G69,UOM_Conversions!$A$2:$E$50,4,FALSE),IF($H69=\"Volume\",$F69*VLOOKUP(\"Volume|\"&$G69,UOM_Conversions!$A$2:$E$50,4,FALSE),$F69*VLOOKUP(\"Each|\"&$G69,UOM_Conversions!$A$2:$E$50,4,FALSE))))","v":""},""]
[{"$nulls":9},{"$f":"IF($B70=\"\",\"\",IF($H70=\"Weight\",$F70*VLOOKUP(\"Weight|\"&$G70,UOM_Conversions!$A$2:$E$50,4,FALSE),IF($H70=\"Volume\",$F70*VLOOKUP(\"Volume|\"&$G70,UOM_Conversions!$A$2:$E$50,4,FALSE),$F70*VLOOKUP(\"Each|\"&$G70,UOM_Conversions!$A$2:$E$50,4,FALSE))))","v":""},""]
[{"$nulls":9},{"$f":"IF($B71=\"\",\"\",IF($H71=\"Weight\",$F71*VLOOKUP(\"Weight|\"&$G71,UOM_Conversions!$A$2:$E$50,4,FALSE),IF($H71=\"Volume\",$F71*VLOOKUP(\"Volume|\"&$G71,UOM_Conversions!$A$2:$E$50,4,FALSE),$F71*VLOOKUP(\"Each|\"&$G71,UOM_Conversions!$A$2:$E$50,4,FALSE))))","v":""},""]
[{"$nulls":9},{"$f":"IF($B72=\"\",\"\",IF($H72=\"Weight\",$F72*VLOOKUP(\"Weight|\"&$G72,UOM_Conversions!$A$2:$E$50,4,FALSE),IF($H72=\"Volume\",$F72*VLOOKUP(\"Volume|\"&$G72,UOM_Conversions!$A$2:$E$50,4,FALSE),$F72*VLOOKUP(\"Each|\"&$G72,UOM_Conversions!$A$2:$E$50,4,FALSE))))","v":""},""]
[{"$nulls":9},{"$f":"IF($B73=\"\",\"\",IF($H73=\"Weight\",$F73*VLOOKUP(\"Weight|\"&$G73,UOM_Conversions!$A$2:$E$50,4,FALSE),IF($H73=\"Volume\",$F73*VLOOKUP(\"Volume|\"&$G73,UOM_Conversions!$A$2:$E$50,4,FALSE),$F73*VLOOKUP(\"Each|\"&$G73,UOM_Conversions!$A$2:$E$50,4,FALSE))))","v":""},""]
[{"$nulls":9},{"$f":"IF($B74=\"\",\"\",IF($H74=\"Weight\",$F74*VLOOKUP(\"Weight|\"&$G74,UOM_Conversions!$A$2:$E$50,4,FALSE),IF($H74=\"Volume\",$F74*VLOOKUP(\"Volume|\"&$G74,UOM_Conversions!$A$2:$E$50,4,FALSE),$F74*VLOOKUP(\"Each|\"&$G74,UOM_Conversions!$A$2:$E$50,4,FALSE))))","v":""},""]
[{"$nulls":9},{"$f":"IF($B75=\"\",\"\",IF($H75=\"Weight\",$F75*VLOOKUP(\"Weight|\"&$G75,UOM_Conversions!$A$2:$E$50,4,FALSE),IF($H75=\"Volume\",$F75*VLOOKUP(\"Volume|\"&$G75,UOM_Conversions!$A$2:$E$50,4,FALSE),$F75*VLOOKUP(\"Each|\"&$G75,UOM_Conversions!$A$2:$E$50,4,FALSE))))","v":""},""]
[{"$nulls":9},{"$f":"IF($B76=\"\",\"\",IF($H76=\"Weight\",$F76*VLOOKUP(\"Weight|\"&$G76,UOM_Conversions!$A$2:$E$50,4,FALSE),IF($H76=\"Volume\",$F76*VLOOKUP(\"Volume|\"&$G76,UOM_Conversions!$A$2:$E$50,4,FALSE),$F76*VLOOKUP(\"Each|\"&$G76,UOM_Conversions!$A$2:$E$50,4,FALSE))))","v":""},""]
[{"$nulls":9},{"$f":"IF($B77=\"\",\"\",IF($H77=\"Weight\",$F77*VLOOKUP(\"Weight|\"&$G77,UOM_Conversions!$A$2:$E$50,4,FALSE),IF($H77=\"Volume\",$F77*VLOOKUP(\"Volume|\"&$G77,UOM_Conversions!$A$2:$E$50,4,FALSE),$F77*VLOOKUP(\"Each|\"&$G77,UOM_Conversions!$A$2:$E$50,4,FALSE))))","v":""},""]
[{"$nulls":9},{"$f":"IF($B78=\"\",\"\",IF($H78=\"Weight\",$F78*VLOOKUP(\"Weight|\"&$G78,UOM_Conversions!$A$2:$E$50,4,FALSE),IF($H78=\"Volume\",$F78*VLOOKUP(\"Volume|\"&$G78,UOM_Conversions!$A$2:$E$50,4,FALSE),$F78*VLOOKUP(\"Each|\"&$G78,UOM_Conversions!$A$2:$E$50,4,FALSE))))","v":""},""]
[{"$nulls":9},{"$f":"IF($B79=\"\",\"\",IF($H79=\"Weight\",$F79*VLOOKUP(\"Weight|\"&$G79,UOM_Conversions!$A$2:$E$50,4,FALSE),IF($H79=\"Volume\",$F79*VLOOKUP(\"Volume|\"&$G79,UOM_Conversions!$A$2:$E$50,4,FALSE),$F79*VLOOKUP(\"Each|\"&$G79,UOM_Conversions!$A$2:$E$50,4,FALSE))))","v":""},""]
[{"$nulls":9},{"$f":"IF($B80=\"\",\"\",IF($H80=\"Weight\",$F80*VLOOKUP(\"Weight|\"&$G80,UOM_Conversions!$A$2:$E$50,4,FALSE),IF($H80=\"Volume\",$F80*VLOOKUP(\"Volume|\"&$G80,UOM_Conversions!$A$2:$E$50,4,FALSE),$F80*VLOOKUP(\"Each|\"&$G80,UOM_Conversions!$A$2:$E$50,4,FALSE))))","v":""},""]
[{"$nulls":9},{"$f":"IF($B81=\"\",\"\",IF($H81=\"Weight\",$F81*VLOOKUP(\"Weight|\"&$G81,UOM_Conversions!$A$2:$E$50,4,FALSE),IF($H81=\"Volume\",$F81*VLOOKUP(\"Volume|\"&$G81,UOM_Conversions!$A$2:$E$50,4,FALSE),$F81*VLOOKUP(\"Each|\"&$G81,UOM_Conversions!$A$2:$E$50,4,FALSE))))","v":""},""]
[{"$nulls":9},{"$f":"IF($B82=\"\",\"\",IF($H82=\"Weight\",$F82*VLOOKUP(\"Weight|\"&$G82,UOM_Conversions!$A$2:$E$50,4,FALSE),IF($H82=\"Volume\",$F82*VLOOKUP(\"Volume|\"&$G82,UOM_Conversions!$A$2:$E$50,4,FALSE),$F82*VLOOKUP(\"Each|\"&$G82,UOM_Conversions!$A$2:$E$50,4,FALSE))))","v":""},""]
[{"$nulls":9},{"$f":"IF($B83=\"\",\"\",IF($H83=\"Weight\",$F83*VLOOKUP(\"Weight|\"&$G83,UOM_Conversions!$A$2:$E$50,4,FALSE),IF($H83=\"Volume\",$F83*VLOOKUP(\"Volume|\"&$G83,UOM_Conversions!$A$2:$E$50,4,FALSE),$F83*VLOOKUP(\"Each|\"&$G83,UOM_Conversions!$A$2:$E$50,4,FALSE))))","v":""},""]
[{"$nulls":9},{"$f":"IF($B84=\"\",\"\",IF($H84=\"Weight\",$F84*VLOOKUP(\"Weight|\"&$G84,UOM_Conversions!$A$2:$E$50,4,FALSE),IF($H84=\"Volume\",$F84*VLOOKUP(\"Volume|\"&$G84,UOM_Conversions!$A$2:$E$50,4,FALSE),$F84*VLOOKUP(\"Each|\"&$G84,UOM_Conversions!$A$2:$E$50,4,FALSE))))","v":""},""]
[{"$nulls":9},{"$f":"IF($B85=\"\",\"\",IF($H85=\"Weight\",$F85*VLOOKUP(\"Weight|\"&$G85,UOM_Conversions!$A$2:$E$50,4,FALSE),IF($H85=\"Volume\",$F85*VLOOKUP(\"Volume|\"&$G85,UOM_Conversions!$A$2:$E$50,4,FALSE),$F85*VLOOKUP(\"Each|\"&$G85,UOM_Conversions!$A$2:$E$50,4,FALSE))))","v":""},""]
[{"$nulls":9},{"$f":"IF($B86=\"\",\"\",IF($H86=\"Weight\",$F86*VLOOKUP(\"Weight|\"&$G86,UOM_Conversions!$A$2:$E$50,4,FALSE),IF($H86=\"Volume\",$F86*VLOOKUP(\"Volume|\"&$G86,UOM_Conversions!$A$2:$E$50,4,FALSE),$F86*VLOOKUP(\"Each|\"&$G86,UOM_Conversions!$A$2:$E$50,4,FALSE))))","v":""},""]
[{"$nulls":9},{"$f":"IF($B87=\"\",\"\",IF($H87=\"Weight\",$F87*VLOOKUP(\"Weight|\"&$G87,UOM_Conversions!$A$2:$E$50,4,FALSE),IF($H87=\"Volume\",$F87*VLOOKUP(\"Volume|\"&$G87,UOM_Conversions!$A$2:$E$50,4,FALSE),$F87*VLOOKUP(\"Each|\"&$G87,UOM_Conversions!$A$2:$E$50,4,FALSE))))","v":""},""]
[{"$nulls":9},{"$f":"IF($B88=\"\",\"\",IF($H88=\"Weight\",$F88*VLOOKUP(\"Weight|\"&$G88,UOM_Conversions!$A$2:$E$50,4,FALSE),IF($H88=\"Volume\",$F88*VLOOKUP(\"Volume|\"&$G88,UOM_Conversions!$A$2:$E$50,4,FALSE),$F88*VLOOKUP(\"Each|\"&$G88,UOM_Conversions!$A$2:$E$50,4,FALSE))))","v":""},""]
[{"$nulls":9},{"$f":"IF($B89=\"\",\"\",IF($H89=\"Weight\",$F89*VLOOKUP(\"Weight|\"&$G89,UOM_Conversions!$A$2:$E$50,4,FALSE),IF($H89=\"Volume\",$F89*VLOOKUP(\"Volume|\"&$G89,UOM_Conversions!$A$2:$E$50,4,FALSE),$F89*VLOOKUP(\"Each|\"&$G89,UOM_Conversions!$A$2:$E$50,4,FALSE))))","v":""},""]
[{"$nulls":9},{"$f":"IF($B90=\"\",\"\",IF($H90=\"Weight\",$F90*VLOOKUP(\"Weight|\"&$G90,UOM_Conversions!$A$2:$E$50,4,FALSE),IF($H90=\"Volume\",$F90*VLOOKUP(\"Volume|\"&$G90,UOM_Conversions!$A$2:$E$50,4,FALSE),$F90*VLOOKUP(\"Each|\"&$G90,UOM_Conversions!$A$2:$E$50,4,FALSE))))","v":""},""]
[{"$nulls":9},{"$f":"IF($B91=\"\",\"\",IF($H91=\"Weight\",$F91*VLOOKUP(\"Weight|\"&$G91,UOM_Conversions!$A$2:$E$50,4,FALSE),IF($H91=\"Volume\",$F91*VLOOKUP(\"Volume|\"&$G91,UOM_Conversions!$A$2:$E$50,4,FALSE),$F91*VLOOKUP(\"Each|\"&$G91,UOM_Conversions!$A$2:$E$50,4,FALSE))))","v":""},""]
[{"$nulls":9},{"$f":"IF($B92=\"\",\"\",IF($H92=\"Weight\",$F92*VLOOKUP(\"Weight|\"&$G92,UOM_Conversions!$A$2:$E$50,4,FALSE),IF($H92=\"Volume\",$F92*VLOOKUP(\"Volume|\"&$G92,UOM_Conversions!$A$2:$E$50,4,FALSE),$F92*VLOOKUP(\"Each|\"&$G92,UOM_Conversions!$A$2:$E$50,4,FALSE))))","v":""},""]
[{"$nulls":9},{"$f":"IF($B93=\"\",\"\",IF($H93=\"Weight\",$F93*VLOOKUP(\"Weight|\"&$G93,UOM_Conversions!$A$2:$E$50,4,FALSE),IF($H93=\"Volume\",$F93*VLOOKUP(\"Volume|\"&$G93,UOM_Conversions!$A$2:$E$50,4,FALSE),$F93*VLOOKUP(\"Each|\"&$G93,UOM_Conversions!$A$2:$E$50,4,FALSE))))","v":""},""]
[{"$nulls":9},{"$f":"IF($B94=\"\",\"\",IF($H94=\"Weight\",$F94*VLOOKUP(\"Weight|\"&$G94,UOM_Conversions!$A$2:$E$50,4,FALSE),IF($H94=\"Volume\",$F94*VLOOKUP(\"Volume|\"&$G94,UOM_Conversions!$A$2:$E$50,4,FALSE),$F94*VLOOKUP(\"Each|\"&$G94,UOM_Conversions!$A$2:$E$50,4,FALSE))))","v":""},""]
[{"$nulls":9},{"$f":"IF($B95=\"\",\"\",IF($H95=\"Weight\",$F95*VLOOKUP(\"Weight|\"&$G95,UOM_Conversions!$A$2:$E$50,4,FALSE),IF($H95=\"Volume\",$F95*VLOOKUP(\"Volume|\"&$G95,UOM_Conversions!$A$2:$E$50,4,FALSE),$F95*VLOOKUP(\"Each|\"&$G95,UOM_Conversions!$A$2:$E$50,4,FALSE))))","v":""},""]
[{"$nulls":9},{"$f":"IF($B96=\"\",\"\",IF($H96=\"Weight\",$F96*VLOOKUP(\"Weight|\"&$G96,UOM_Conversions!$A$2:$E$50,4,FALSE),IF($H96=\"Volume\",$F96*VLOOKUP(\"Volume|\"&$G96,UOM_Conversions!$A$2:$E$50,4,FALSE),$F96*VLOOKUP(\"Each|\"&$G96,UOM_Conversions!$A$2:$E$50,4,FALSE))))","v":""},""]
[{"$nulls":9},{"$f":"IF($B97=\"\",\"\",IF($H97=\"Weight\",$F97*VLOOKUP(\"Weight|\"&$G97,UOM_Conversions!$A$2:$E$50,4,FALSE),IF($H97=\"Volume\",$F97*VLOOKUP(\"Volume|\"&$G97,UOM_Conversions!$A$2:$E$50,4,FALSE),$F97*VLOOKUP(\"Each|\"&$G97,UOM_Conversions!$A$2:$E$50,4,FALSE))))","v":""},""]
[{"$nulls":9},{"$f":"IF($B98=\"\",\"\",IF($H98=\"Weight\",$F98*VLOOKUP(\"Weight|\"&$G98,UOM_Conversions!$A$2:$E$50,4,FALSE),IF($H98=\"Volume\",$F98*VLOOKUP(\"Volume|\"&$G98,UOM_Conversions!$A$2:$E$50,4,FALSE),$F98*VLOOKUP(\"Each|\"&$G98,UOM_Conversions!$A$2:$E$50,4,FALSE))))","v":""},""]
[{"$nulls":9},{"$f":"IF($B99=\"\",\"\",IF($H99=\"Weight\",$F99*VLOOKUP(\"Weight|\"&$G99,UOM_Conversions!$A$2:$E$50,4,FALSE),IF($H99=\"Volume\",$F99*VLOOKUP(\"Volume|\"&$G99,UOM_Conversions!$A$2:$E$50,4,FALSE),$F99*VLOOKUP(\"Each|\"&$G99,UOM_Conversions!$A$2:$E$50,4,FALSE))))","v":""},""]
[{"$nulls":9},{"$f":"IF($B100=\"\",\"\",IF($H100=\"Weight\",$F100*VLOOKUP(\"Weight|\"&$G100,UOM_Conversions!$A$2:$E$50,4,FALSE),IF($H100=\"Volume\",$F100*VLOOKUP(\"Volume|\"&$G100,UOM_Conversions!$A$2:$E$50,4,FALSE),$F100*VLOOKUP(\"Each|\"&$G100,UOM_Conversions!$A$2:$E$50,4,FALSE))))","v":""},""]
[{"$nulls":9},{"$f":"IF($B101=\"\",\"\",IF($H101=\"Weight\",$F101*VLOOKUP(\"Weight|\"&$G101,UOM_Conversions!$A$2:$E$50,4,FALSE),IF($H101=\"Volume\",$F101*VLOOKUP(\"Volume|\"&$G101,UOM_Conversions!$A$2:$E$50,4,FALSE),$F101*VLOOKUP(\"Each|\"&$G101,UOM_Conversions!$A$2:$E$50,4,FALSE))))","v":""},""]
[{"$nulls":9},{"$f":"IF($B102=\"\",\"\",IF($H102=\"Weight\",$F102*VLOOKUP(\"Weight|\"&$G102,UOM_Conversions!$A$2:$E$50,4,FALSE),IF($H102=\"Volume\",$F102*VLOOKUP(\"Volume|\"&$G102,UOM_Conversions!$A$2:$E$50,4,FALSE),$F102*VLOOKUP(\"Each|\"&$G102,UOM_Conversions!$A$2:$E$50,4,FALSE))))","v":""},""]
[{"$nulls":9},{"$f":"IF($B103=\"\",\"\",IF($H103=\"Weight\",$F103*VLOOKUP(\"Weight|\"&$G103,UOM_Conversions!$A$2:$E$50,4,FALSE),IF($H103=\"Volume\",$F103*VLOOKUP(\"Volume|\"&$G103,UOM_Conversions!$A$2:$E$50,4,FALSE),$F103*VLOOKUP(\"Each|\"&$G103,UOM_Conversions!$A$2:$E$50,4,FALSE))))","v":""},""]
[{"$nulls":9},{"$f":"IF($B104=\"\",\"\",IF($H104=\"Weight\",$F104*VLOOKUP(\"Weight|\"&$G104,UOM_Conversions!$A$2:$E$50,4,FALSE),IF($H104=\"Volume\",$F104*VLOOKUP(\"Volume|\"&$G104,UOM_Conversions!$A$2:$E$50,4,FALSE),$F104*VLOOKUP(\"Each|\"&$G104,UOM_Conversions!$A$2:$E$50,4,FALSE))))","v":""},""]
[{"$nulls":9},{"$f":"IF($B105=\"\",\"\",IF($H105=\"Weight\",$F105*VLOOKUP(\"Weight|\"&$G105,UOM_Conversions!$A$2:$E$50,4,FALSE),IF($H105=\"Volume\",$F105*VLOOKUP(\"Volume|\"&$G105,UOM_Conversions!$A$2:$E$50,4,FALSE),$F105*VLOOKUP(\"Each|\"&$G105,UOM_Conversions!$A$2:$E$50,4,FALSE))))","v":""},""]
[{"$nulls":9},{"$f":"IF($B106=\"\",\"\",IF($H106=\"Weight\",$F106*VLOOKUP(\"Weight|\"&$G106,UOM_Conversions!$A$2:$E$50,4,FALSE),IF($H106=\"Volume\",$F106*VLOOKUP(\"Volume|\"&$G106,UOM_Conversions!$A$2:$E$50,4,FALSE),$F106*VLOOKUP(\"Each|\"&$G106,UOM_Conversions!$A$2:$E$50,4,FALSE))))","v":""},""]
[{"$nulls":9},{"$f":"IF($B107=\"\",\"\",IF($H107=\"Weight\",$F107*VLOOKUP(\"Weight|\"&$G107,UOM_Conversions!$A$2:$E$50,4,FALSE),IF($H107=\"Volume\",$F107*VLOOKUP(\"Volume|\"&$G107,UOM_Conversions!$A$2:$E$50,4,FALSE),$F107*VLOOKUP(\"Each|\"&$G107,UOM_Conversions!$A$2:$E$50,4,FALSE))))","v":""},""]
[{"$nulls":9},{"$f":"IF($B108=\"\",\"\",IF($H108=\"Weight\",$F108*VLOOKUP(\"Weight|\"&$G108,UOM_Conversions!$A$2:$E$50,4,FALSE),IF($H108=\"Volume\",$F108*VLOOKUP(\"Volume|\"&$G108,UOM_Conversions!$A$2:$E$50,4,FALSE),$F108*VLOOKUP(\"Each|\"&$G108,UOM_Conversions!$A$2:$E$50,4,FALSE))))","v":""},""]
[{"$nulls":9},{"$f":"IF($B109=\"\",\"\",IF($H109=\"Weight\",$F109*VLOOKUP(\"Weight|\"&$G109,UOM_Conversions!$A$2:$E$50,4,FALSE),IF($H109=\"Volume\",$F109*VLOOKUP(\"Volume|\"&$G109,UOM_Conversions!$A$2:$E$50,4,FALSE),$F109*VLOOKUP(\"Each|\"&$G109,UOM_Conversions!$A$2:$E$50,4,FALSE))))","v":""},""]
[{"$nulls":9},{"$f":"IF($B110=\"\",\"\",IF($H110=\"Weight\",$F110*VLOOKUP(\"Weight|\"&$G110,UOM_Conversions!$A$2:$E$50,4,FALSE),IF($H110=\"Volume\",$F110*VLOOKUP(\"Volume|\"&$G110,UOM_Conversions!$A$2:$E$50,4,FALSE),$F110*VLOOKUP(\"Each|\"&$G110,UOM_Conversions!$A$2:$E$50,4,FALSE))))","v":""},""]
[{"$nulls":9},{"$f":"IF($B111=\"\",\"\",IF($H111=\"Weight\",$F111*VLOOKUP(\"Weight|\"&$G111,UOM_Conversions!$A$2:$E$50,4,FALSE),IF($H111=\"Volume\",$F111*VLOOKUP(\"Volume|\"&$G111,UOM_Conversions!$A$2:$E$50,4,FALSE),$F111*VLOOKUP(\"Each|\"&$G111,UOM_Conversions!$A$2:$E$50,4,FALSE))))","v":""},""]
[{"$nulls":9},{"$f":"IF($B112=\"\",\"\",IF($H112=\"Weight\",$F112*VLOOKUP(\"Weight|\"&$G112,UOM_Conversions!$A$2:$E$50,4,FALSE),IF($H112=\"Volume\",$F112*VLOOKUP(\"Volume|\"&$G112,UOM_Conversions!$A$2:$E$50,4,FALSE),$F112*VLOOKUP(\"Each|\"&$G112,UOM_Conversions!$A$2:$E$50,4,FALSE))))","v":""},""]
[{"$nulls":9},{"$f":"IF($B113=\"\",\"\",IF($H113=\"Weight\",$F113*VLOOKUP(\"Weight|\"&$G113,UOM_Conversions!$A$2:$E$50,4,FALSE),IF($H113=\"Volume\",$F113*VLOOKUP(\"Volume|\"&$G113,UOM_Conversions!$A$2:$E$50,4,FALSE),$F113*VLOOKUP(\"Each|\"&$G113,UOM_Conversions!$A$2:$E$50,4,FALSE))))","v":""},""]
[{"$nulls":9},{"$f":"IF($B114=\"\",\"\",IF($H114=\"Weight\",$F114*VLOOKUP(\"Weight|\"&$G114,UOM_Conversions!$A$2:$E$50,4,FALSE),IF($H114=\"Volume\",$F114*VLOOKUP(\"Volume|\"&$G114,UOM_Conversions!$A$2:$E$50,4,FALSE),$F114*VLOOKUP(\"Each|\"&$G114,UOM_Conversions!$A$2:$E$50,4,FALSE))))","v":""},""]
[{"$nulls":9},{"$f":"IF($B115=\"\",\"\",IF($H115=\"Weight\",$F115*VLOOKUP(\"Weight|\"&$G115,UOM_Conversions!$A$2:$E$50,4,FALSE),IF($H115=\"Volume\",$F115*VLOOKUP(\"Volume|\"&$G115,UOM_Conversions!$A$2:$E$50,4,FALSE),$F115*VLOOKUP(\"Each|\"&$G115,UOM_Conversions!$A$2:$E$50,4,FALSE))))","v":""},""]
[{"$nulls":9},{"$f":"IF($B116=\"\",\"\",IF($H116=\"Weight\",$F116*VLOOKUP(\"Weight|\"&$G116,UOM_Conversions!$A$2:$E$50,4,FALSE),IF($H116=\"Volume\",$F116*VLOOKUP(\"Volume|\"&$G116,UOM_Conversions!$A$2:$E$50,4,FALSE),$F116*VLOOKUP(\"Each|\"&$G116,UOM_Conversions!$A$2:$E$50,4,FALSE))))","v":""},""]
[{"$nulls":9},{"$f":"IF($B117=\"\",\"\",IF($H117=\"Weight\",$F117*VLOOKUP(\"Weight|\"&$G117,UOM_Conversions!$A$2:$E$50,4,FALSE),IF($H117=\"Volume\",$F117*VLOOKUP(\"Volume|\"&$G117,UOM_Conversions!$A$2:$E$50,4,FALSE),$F117*VLOOKUP(\"Each|\"&$G117,UOM_Conversions!$A$2:$E$50,4,FALSE))))","v":""},""]
[{"$nulls":9},{"$f":"IF($B118=\"\",\"\",IF($H118=\"Weight\",$F118*VLOOKUP(\"Weight|\"&$G118,UOM_Conversions!$A$2:$E$50,4,FALSE),IF($H118=\"Volume\",$F118*VLOOKUP(\"Volume|\"&$G118,UOM_Conversions!$A$2:$E$50,4,FALSE),$F118*VLOOKUP(\"Each|\"&$G118,UOM_Conversions!$A$2:$E$50,4,FALSE))))","v":""},""]
[{"$nulls":9},{"$f":"IF($B119=\"\",\"\",IF($H119=\"Weight\",$F119*VLOOKUP(\"Weight|\"&$G119,UOM_Conversions!$A$2:$E$50,4,FALSE),IF($H119=\"Volume\",$F119*VLOOKUP(\"Volume|\"&$G119,UOM_Conversions!$A$2:$E$50,4,FALSE),$F119*VLOOKUP(\"Each|\"&$G119,UOM_Conversions!$A$2:$E$50,4,FALSE))))","v":""},""]
[{"$nulls":9},{"$f":"IF($B120=\"\",\"\",IF($H120=\"Weight\",$F120*VLOOKUP(\"Weight|\"&$G120,UOM_Conversions!$A$2:$E$50,4,FALSE),IF($H120=\"Volume\",$F120*VLOOKUP(\"Volume|\"&$G120,UOM_Conversions!$A$2:$E$50,4,FALSE),$F120*VLOOKUP(\"Each|\"&$G120,UOM_Conversions!$A$2:$E$50,4,FALSE))))","v":""},""]
[{"$nulls":9},{"$f":"IF($B121=\"\",\"\",IF($H121=\"Weight\",$F121*VLOOKUP(\"Weight|\"&$G121,UOM_Conversions!$A$2:$E$50,4,FALSE),IF($H121=\"Volume\",$F121*VLOOKUP(\"Volume|\"&$G121,UOM_Conversions!$A$2:$E$50,4,FALSE),$F121*VLOOKUP(\"Each|\"&$G121,UOM_Conversions!$A$2:$E$50,4,FALSE))))","v":""},""]
[{"$nulls":9},{"$f":"IF($B122=\"\",\"\",IF($H122=\"Weight\",$F122*VLOOKUP(\"Weight|\"&$G122,UOM_Conversions!$A$2:$E$50,4,FALSE),IF($H122=\"Volume\",$F122*VLOOKUP(\"Volume|\"&$G122,UOM_Conversions!$A$2:$E$50,4,FALSE),$F122*VLOOKUP(\"Each|\"&$G122,UOM_Conversions!$A$2:$E$50,4,FALSE))))","v":""},""]
[{"$nulls":9},{"$f":"IF($B123=\"\",\"\",IF($H123=\"Weight\",$F123*VLOOKUP(\"Weight|\"&$G123,UOM_Conversions!$A$2:$E$50,4,FALSE),IF($H123=\"Volume\",$F123*VLOOKUP(\"Volume|\"&$G123,UOM_Conversions!$A$2:$E$50,4,FALSE),$F123*VLOOKUP(\"Each|\"&$G123,UOM_Conversions!$A$2:$E$50,4,FALSE))))","v":""},""]
[{"$nulls":9},{"$f":"IF($B124=\"\",\"\",IF($H124=\"Weight\",$F124*VLOOKUP(\"Weight|\"&$G124,UOM_Conversions!$A$2:$E$50,4,FALSE),IF($H124=\"Volume\",$F124*VLOOKUP(\"Volume|\"&$G124,UOM_Conversions!$A$2:$E$50,4,FALSE),$F124*VLOOKUP(\"Each|\"&$G124,UOM_Conversions!$A$2:$E$50,4,FALSE))))","v":""},""]
[{"$nulls":9},{"$f":"IF($B125=\"\",\"\",IF($H125=\"Weight\",$F125*VLOOKUP(\"Weight|\"&$G125,UOM_Conversions!$A$2:$E$50,4,FALSE),IF($H125=\"Volume\",$F125*VLOOKUP(\"Volume|\"&$G125,UOM_Conversions!$A$2:$E$50,4,FALSE),$F125*VLOOKUP(\"Each|\"&$G125,UOM_Conversions!$A$2:$E$50,4,FALSE))))","v":""},""]
[{"$nulls":9},{"$f":"IF($B126=\"\",\"\",IF($H126=\"Weight\",$F126*VLOOKUP(\"Weight|\"&$G126,UOM_Conversions!$A$2:$E$50,4,FALSE),IF($H126=\"Volume\",$F126*VLOOKUP(\"Volume|\"&$G126,UOM_Conversions!$A$2:$E$50,4,FALSE),$F126*VLOOKUP(\"Each|\"&$G126,UOM_Conversions!$A$2:$E$50,4,FALSE))))","v":""},""]
[{"$nulls":9},{"$f":"IF($B127=\"\",\"\",IF($H127=\"Weight\",$F127*VLOOKUP(\"Weight|\"&$G127,UOM_Conversions!$A$2:$E$50,4,FALSE),IF($H127=\"Volume\",$F127*VLOOKUP(\"Volume|\"&$G127,UOM_Conversions!$A$2:$E$50,4,FALSE),$F127*VLOOKUP(\"Each|\"&$G127,UOM_Conversions!$A$2:$E$50,4,FALSE))))","v":""},""]
[{"$nulls":9},{"$f":"IF($B128=\"\",\"\",IF($H128=\"Weight\",$F128*VLOOKUP(\"Weight|\"&$G128,UOM_Conversions!$A$2:$E$50,4,FALSE),IF($H128=\"Volume\",$F128*VLOOKUP(\"Volume|\"&$G128,UOM_Conversions!$A$2:$E$50,4,FALSE),$F128*VLOOKUP(\"Each|\"&$G128,UOM_Conversions!$A$2:$E$50,4,FALSE))))","v":""},""]
[{"$nulls":9},{"$f":"IF($B129=\"\",\"\",IF($H129=\"Weight\",$F129*VLOOKUP(\"Weight|\"&$G129,UOM_Conversions!$A$2:$E$50,4,FALSE),IF($H129=\"Volume\",$F129*VLOOKUP(\"Volume|\"&$G129,UOM_Conversions!$A$2:$E$50,4,FALSE),$F129*VLOOKUP(\"Each|\"&$G129,UOM_Conversions!$A$2:$E$50,4,FALSE))))","v":""},""]
[{"$nulls":9},{"$f":"IF($B130=\"\",\"\",IF($H130=\"Weight\",$F130*VLOOKUP(\"Weight|\"&$G130,UOM_Conversions!$A$2:$E$50,4,FALSE),IF($H130=\"Volume\",$F130*VLOOKUP(\"Volume|\"&$G130,UOM_Conversions!$A$2:$E$50,4,FALSE),$F130*VLOOKUP(\"Each|\"&$G130,UOM_Conversions!$A$2:$E$50,4,FALSE))))","v":""},{"$f":"IF($B130=\"\",\"\",IFERROR($E130/$J130,0))","v":""}]
[{"$nulls":9},{"$f":"IF($B131=\"\",\"\",IF($H131=\"Weight\",$F131*VLOOKUP(\"Weight|\"&$G131,UOM_Conversions!$A$2:$E$50,4,FALSE),IF($H131=\"Volume\",$F131*VLOOKUP(\"Volume|\"&$G131,UOM_Conversions!$A$2:$E$50,4,FALSE),$F131*VLOOKUP(\"Each|\"&$G131,UOM_Conversions!$A$2:$E$50,4,FALSE))))","v":""},""]
[{"$nulls":9},{"$f":"IF($B132=\"\",\"\",IF($H132=\"Weight\",$F132*VLOOKUP(\"Weight|\"&$G132,UOM_Conversions!$A$2:$E$50,4,FALSE),IF($H132=\"Volume\",$F132*VLOOKUP(\"Volume|\"&$G132,UOM_Conversions!$A$2:$E$50,4,FALSE),$F132*VLOOKUP(\"Each|\"&$G132,UOM_Conversions!$A$2:$E$50,4,FALSE))))","v":""},""]
[{"$nulls":9},{"$f":"IF($B133=\"\",\"\",IF($H133=\"Weight\",$F133*VLOOKUP(\"Weight|\"&$G133,UOM_Conversions!$A$2:$E$50,4,FALSE),IF($H133=\"Volume\",$F133*VLOOKUP(\"Volume|\"&$G133,UOM_Conversions!$A$2:$E$50,4,FALSE),$F133*VLOOKUP(\"Each|\"&$G133,UOM_Conversions!$A$2:$E$50,4,FALSE))))","v":""},""]
[{"$nulls":9},{"$f":"IF($B134=\"\",\"\",IF($H134=\"Weight\",$F134*VLOOKUP(\"Weight|\"&$G134,UOM_Conversions!$A$2:$E$50,4,FALSE),IF($H134=\"Volume\",$F134*VLOOKUP(\"Volume|\"&$G134,UOM_Conversions!$A$2:$E$50,4,FALSE),$F134*VLOOKUP(\"Each|\"&$G134,UOM_Conversions!$A$2:$E$50,4,FALSE))))","v":""},""]
[{"$nulls":9},{"$f":"IF($B135=\"\",\"\",IF($H135=\"Weight\",$F135*VLOOKUP(\"Weight|\"&$G135,UOM_Conversions!$A$2:$E$50,4,FALSE),IF($H135=\"Volume\",$F135*VLOOKUP(\"Volume|\"&$G135,UOM_Conversions!$A$2:$E$50,4,FALSE),$F135*VLOOKUP(\"Each|\"&$G135,UOM_Conversions!$A$2:$E$50,4,FALSE))))","v":""},""]
[{"$nulls":9},{"$f":"IF($B136=\"\",\"\",IF($H136=\"Weight\",$F136*VLOOKUP(\"Weight|\"&$G136,UOM_Conversions!$A$2:$E$50,4,FALSE),IF($H136=\"Volume\",$F136*VLOOKUP(\"Volume|\"&$G136,UOM_Conversions!$A$2:$E$50,4,FALSE),$F136*VLOOKUP(\"Each|\"&$G136,UOM_Conversions!$A$2:$E$50,4,FALSE))))","v":""},""]
[{"$nulls":9},{"$f":"IF($B137=\"\",\"\",IF($H137=\"Weight\",$F137*VLOOKUP(\"Weight|\"&$G137,UOM_Conversions!$A$2:$E$50,4,FALSE),IF($H137=\"Volume\",$F137*VLOOKUP(\"Volume|\"&$G137,UOM_Conversions!$A$2:$E$50,4,FALSE),$F137*VLOOKUP(\"Each|\"&$G137,UOM_Conversions!$A$2:$E$50,4,FALSE))))","v":""},""]
[{"$nulls":9},{"$f":"IF($B138=\"\",\"\",IF($H138=\"Weight\",$F138*VLOOKUP(\"Weight|\"&$G138,UOM_Conversions!$A$2:$E$50,4,FALSE),IF($H138=\"Volume\",$F138*VLOOKUP(\"Volume|\"&$G138,UOM_Conversions!$A$2:$E$50,4,FALSE),$F138*VLOOKUP(\"Each|\"&$G138,UOM_Conversions!$A$2:$E$50,4,FALSE))))","v":""},""]
[{"$nulls":9},{"$f":"IF($B139=\"\",\"\",IF($H139=\"Weight\",$F139*VLOOKUP(\"Weight|\"&$G139,UOM_Conversions!$A$2:$E$50,4,FALSE),IF($H139=\"Volume\",$F139*VLOOKUP(\"Volume|\"&$G139,UOM_Conversions!$A$2:$E$50,4,FALSE),$F139*VLOOKUP(\"Each|\"&$G139,UOM_Conversions!$A$2:$E$50,4,FALSE))))","v":""},""]
[{"$nulls":9},{"$f":"IF($B140=\"\",\"\",IF($H140=\"Weight\",$F140*VLOOKUP(\"Weight|\"&$G140,UOM_Conversions!$A$2:$E$50,4,FALSE),IF($H140=\"Volume\",$F140*VLOOKUP(\"Volume|\"&$G140,UOM_Conversions!$A$2:$E$50,4,FALSE),$F140*VLOOKUP(\"Each|\"&$G140,UOM_Conversions!$A$2:$E$50,4,FALSE))))","v":""},""]
[{"$nulls":9},{"$f":"IF($B141=\"\",\"\",IF($H141=\"Weight\",$F141*VLOOKUP(\"Weight|\"&$G141,UOM_Conversions!$A$2:$E$50,4,FALSE),IF($H141=\"Volume\",$F141*VLOOKUP(\"Volume|\"&$G141,UOM_Conversions!$A$2:$E$50,4,FALSE),$F141*VLOOKUP(\"Each|\"&$G141,UOM_Conversions!$A$2:$E$50,4,FALSE))))","v":""},""]
[{"$nulls":9},{"$f":"IF($B142=\"\",\"\",IF($H142=\"Weight\",$F142*VLOOKUP(\"Weight|\"&$G142,UOM_Conversions!$A$2:$E$50,4,FALSE),IF($H142=\"Volume\",$F142*VLOOKUP(\"Volume|\"&$G142,UOM_Conversions!$A$2:$E$50,4,FALSE),$F142*VLOOKUP(\"Each|\"&$G142,UOM_Conversions!$A$2:$E$50,4,FALSE))))","v":""},""]
[{"$nulls":9},{"$f":"IF($B143=\"\",\"\",IF($H143=\"Weight\",$F143*VLOOKUP(\"Weight|\"&$G143,UOM_Conversions!$A$2:$E$50,4,FALSE),IF($H143=\"Volume\",$F143*VLOOKUP(\"Volume|\"&$G143,UOM_Conversions!$A$2:$E$50,4,FALSE),$F143*VLOOKUP(\"Each|\"&$G143,UOM_Conversions!$A$2:$E$50,4,FALSE))))","v":""},""]
[{"$nulls":9},{"$f":"IF($B144=\"\",\"\",IF($H144=\"Weight\",$F144*VLOOKUP(\"Weight|\"&$G144,UOM_Conversions!$A$2:$E$50,4,FALSE),IF($H144=\"Volume\",$F144*VLOOKUP(\"Volume|\"&$G144,UOM_Conversions!$A$2:$E$50,4,FALSE),$F144*VLOOKUP(\"Each|\"&$G144,UOM_Conversions!$A$2:$E$50,4,FALSE))))","v":""},""]
[{"$nulls":9},{"$f":"IF($B145=\"\",\"\",IF($H145=\"Weight\",$F145*VLOOKUP(\"Weight|\"&$G145,UOM_Conversions!$A$2:$E$50,4,FALSE),IF($H145=\"Volume\",$F145*VLOOKUP(\"Volume|\"&$G145,UOM_Conversions!$A$2:$E$50,4,FALSE),$F145*VLOOKUP(\"Each|\"&$G145,UOM_Conversions!$A$2:$E$50,4,FALSE))))","v":""},""]
[{"$nulls":9},{"$f":"IF($B146=\"\",\"\",IF($H146=\"Weight\",$F146*VLOOKUP(\"Weight|\"&$G146,UOM_Conversions!$A$2:$E$50,4,FALSE),IF($H146=\"Volume\",$F146*VLOOKUP(\"Volume|\"&$G146,UOM_Conversions!$A$2:$E$50,4,FALSE),$F146*VLOOKUP(\"Each|\"&$G146,UOM_Conversions!$A$2:$E$50,4,FALSE))))","v":""},""]
[{"$nulls":9},{"$f":"IF($B147=\"\",\"\",IF($H147=\"Weight\",$F147*VLOOKUP(\"Weight|\"&$G147,UOM_Conversions!$A$2:$E$50,4,FALSE),IF($H147=\"Volume\",$F147*VLOOKUP(\"Volume|\"&$G147,UOM_Conversions!$A$2:$E$50,4,FALSE),$F147*VLOOKUP(\"Each|\"&$G147,UOM_Conversions!$A$2:$E$50,4,FALSE))))","v":""},""]
[{"$nulls":9},{"$f":"IF($B148=\"\",\"\",IF($H148=\"Weight\",$F148*VLOOKUP(\"Weight|\"&$G148,UOM_Conversions!$A$2:$E$50,4,FALSE),IF($H148=\"Volume\",$F148*VLOOKUP(\"Volume|\"&$G148,UOM_Conversions!$A$2:$E$50,4,FALSE),$F148*VLOOKUP(\"Each|\"&$G148,UOM_Conversions!$A$2:$E$50,4,FALSE))))","v":""},""]
[{"$nulls":9},{"$f":"IF($B149=\"\",\"\",IF($H149=\"Weight\",$F149*VLOOKUP(\"Weight|\"&$G149,UOM_Conversions!$A$2:$E$50,4,FALSE),IF($H149=\"Volume\",$F149*VLOOKUP(\"Volume|\"&$G149,UOM_Conversions!$A$2:$E$50,4,FALSE),$F149*VLOOKUP(\"Each|\"&$G149,UOM_Conversions!$A$2:$E$50,4,FALSE))))","v":""},""]
[{"$nulls":9},{"$f":"IF($B150=\"\",\"\",IF($H150=\"Weight\",$F150*VLOOKUP(\"Weight|\"&$G150,UOM_Conversions!$A$2:$E$50,4,FALSE),IF($H150=\"Volume\",$F150*VLOOKUP(\"Volume|\"&$G150,UOM_Conversions!$A$2:$E$50,4,FALSE),$F150*VLOOKUP(\"Each|\"&$G150,UOM_Conversions!$A$2:$E$50,4,FALSE))))","v":""},""]
[{"$nulls":9},{"$f":"IF($B151=\"\",\"\",IF($H151=\"Weight\",$F151*VLOOKUP(\"Weight|\"&$G151,UOM_Conversions!$A$2:$E$50,4,FALSE),IF($H151=\"Volume\",$F151*VLOOKUP(\"Volume|\"&$G151,UOM_Conversions!$A$2:$E$50,4,FALSE),$F151*VLOOKUP(\"Each|\"&$G151,UOM_Conversions!$A$2:$E$50,4,FALSE))))","v":""},""]
[{"$nulls":9},{"$f":"IF($B152=\"\",\"\",IF($H152=\"Weight\",$F152*VLOOKUP(\"Weight|\"&$G152,UOM_Conversions!$A$2:$E$50,4,FALSE),IF($H152=\"Volume\",$F152*VLOOKUP(\"Volume|\"&$G152,UOM_Conversions!$A$2:$E$50,4,FALSE),$F152*VLOOKUP(\"Each|\"&$G152,UOM_Conversions!$A$2:$E$50,4,FALSE))))","v":""},""]
[{"$nulls":9},{"$f":"IF($B153=\"\",\"\",IF($H153=\"Weight\",$F153*VLOOKUP(\"Weight|\"&$G153,UOM_Conversions!$A$2:$E$50,4,FALSE),IF($H153=\"Volume\",$F153*VLOOKUP(\"Volume|\"&$G153,UOM_Conversions!$A$2:$E$50,4,FALSE),$F153*VLOOKUP(\"Each|\"&$G153,UOM_Conversions!$A$2:$E$50,4,FALSE))))","v":""},""]
[{"$nulls":9},{"$f":"IF($B154=\"\",\"\",IF($H154=\"Weight\",$F154*VLOOKUP(\"Weight|\"&$G154,UOM_Conversions!$A$2:$E$50,4,FALSE),IF($H154=\"Volume\",$F154*VLOOKUP(\"Volume|\"&$G154,UOM_Conversions!$A$2:$E$50,4,FALSE),$F154*VLOOKUP(\"Each|\"&$G154,UOM_Conversions!$A$2:$E$50,4,FALSE))))","v":""},""]
[{"$nulls":9},{"$f":"IF($B155=\"\",\"\",IF($H155=\"Weight\",$F155*VLOOKUP(\"Weight|\"&$G155,UOM_Conversions!$A$2:$E$50,4,FALSE),IF($H155=\"Volume\",$F155*VLOOKUP(\"Volume|\"&$G155,UOM_Conversions!$A$2:$E$50,4,FALSE),$F155*VLOOKUP(\"Each|\"&$G155,UOM_Conversions!$A$2:$E$50,4,FALSE))))","v":""},""]
[{"$nulls":9},{"$f":"IF($B156=\"\",\"\",IF($H156=\"Weight\",$F156*VLOOKUP(\"Weight|\"&$G156,UOM_Conversions!$A$2:$E$50,4,FALSE),IF($H156=\"Volume\",$F156*VLOOKUP(\"Volume|\"&$G156,UOM_Conversions!$A$2:$E$50,4,FALSE),$F156*VLOOKUP(\"Each|\"&$G156,UOM_Conversions!$A$2:$E$50,4,FALSE))))","v":""},""]
[{"$nulls":9},{"$f":"IF($B157=\"\",\"\",IF($H157=\"Weight\",$F157*VLOOKUP(\"Weight|\"&$G157,UOM_Conversions!$A$2:$E$50,4,FALSE),IF($H157=\"Volume\",$F157*VLOOKUP(\"Volume|\"&$G157,UOM_Conversions!$A$2:$E$50,4,FALSE),$F157*VLOOKUP(\"Each|\"&$G157,UOM_Conversions!$A$2:$E$50,4,FALSE))))","v":""},""]
[{"$nulls":9},{"$f":"IF($B158=\"\",\"\",IF($H158=\"Weight\",$F158*VLOOKUP(\"Weight|\"&$G158,UOM_Conversions!$A$2:$E$50,4,FALSE),IF($H158=\"Volume\",$F158*VLOOKUP(\"Volume|\"&$G158,UOM_Conversions!$A$2:$E$50,4,FALSE),$F158*VLOOKUP(\"Each|\"&$G158,UOM_Conversions!$A$2:$E$50,4,FALSE))))","v":""},""]
[{"$nulls":9},{"$f":"IF($B159=\"\",\"\",IF($H159=\"Weight\",$F159*VLOOKUP(\"Weight|\"&$G159,UOM_Conversions!$A$2:$E$50,4,FALSE),IF($H159=\"Volume\",$F159*VLOOKUP(\"Volume|\"&$G159,UOM_Conversions!$A$2:$E$50,4,FALSE),$F159*VLOOKUP(\"Each|\"&$G159,UOM_Conversions!$A$2:$E$50,4,FALSE))))","v":""},""]
[{"$nulls":9},{"$f":"IF($B160=\"\",\"\",IF($H160=\"Weight\",$F160*VLOOKUP(\"Weight|\"&$G160,UOM_Conversions!$A$2:$E$50,4,FALSE),IF($H160=\"Volume\",$F160*VLOOKUP(\"Volume|\"&$G160,UOM_Conversions!$A$2:$E$50,4,FALSE),$F160*VLOOKUP(\"Each|\"&$G160,UOM_Conversions!$A$2:$E$50,4,FALSE))))","v":""},""]
[{"$nulls":9},{"$f":"IF($B161=\"\",\"\",IF($H161=\"Weight\",$F161*VLOOKUP(\"Weight|\"&$G161,UOM_Conversions!$A$2:$E$50,4,FALSE),IF($H161=\"Volume\",$F161*VLOOKUP(\"Volume|\"&$G161,UOM_Conversions!$A$2:$E$50,4,FALSE),$F161*VLOOKUP(\"Each|\"&$G161,UOM_Conversions!$A$2:$E$50,4,FALSE))))","v":""},""]
[{"$nulls":9},{"$f":"IF($B162=\"\",\"\",IF($H162=\"Weight\",$F162*VLOOKUP(\"Weight|\"&$G162,UOM_Conversions!$A$2:$E$50,4,FALSE),IF($H162=\"Volume\",$F162*VLOOKUP(\"Volume|\"&$G162,UOM_Conversions!$A$2:$E$50,4,FALSE),$F162*VLOOKUP(\"Each|\"&$G162,UOM_Conversions!$A$2:$E$50,4,FALSE))))","v":""},""]
[{"$nulls":9},{"$f":"IF($B163=\"\",\"\",IF($H163=\"Weight\",$F163*VLOOKUP(\"Weight|\"&$G163,UOM_Conversions!$A$2:$E$50,4,FALSE),IF($H163=\"Volume\",$F163*VLOOKUP(\"Volume|\"&$G163,UOM_Conversions!$A$2:$E$50,4,FALSE),$F163*VLOOKUP(\"Each|\"&$G163,UOM_Conversions!$A$2:$E$50,4,FALSE))))","v":""},""]
[{"$nulls":9},{"$f":"IF($B164=\"\",\"\",IF($H164=\"Weight\",$F164*VLOOKUP(\"Weight|\"&$G164,UOM_Conversions!$A$2:$E$50,4,FALSE),IF($H164=\"Volume\",$F164*VLOOKUP(\"Volume|\"&$G164,UOM_Conversions!$A$2:$E$50,4,FALSE),$F164*VLOOKUP(\"Each|\"&$G164,UOM_Conversions!$A$2:$E$50,4,FALSE))))","v":""},""]
[{"$nulls":9},{"$f":"IF($B165=\"\",\"\",IF($H165=\"Weight\",$F165*VLOOKUP(\"Weight|\"&$G165,UOM_Conversions!$A$2:$E$50,4,FALSE),IF($H165=\"Volume\",$F165*VLOOKUP(\"Volume|\"&$G165,UOM_Conversions!$A$2:$E$50,4,FALSE),$F165*VLOOKUP(\"Each|\"&$G165,UOM_Conversions!$A$2:$E$50,4,FALSE))))","v":""},""]
[{"$nulls":9},{"$f":"IF($B166=\"\",\"\",IF($H166=\"Weight\",$F166*VLOOKUP(\"Weight|\"&$G166,UOM_Conversions!$A$2:$E$50,4,FALSE),IF($H166=\"Volume\",$F166*VLOOKUP(\"Volume|\"&$G166,UOM_Conversions!$A$2:$E$50,4,FALSE),$F166*VLOOKUP(\"Each|\"&$G166,UOM_Conversions!$A$2:$E$50,4,FALSE))))","v":""},""]
[{"$nulls":9},{"$f":"IF($B167=\"\",\"\",IF($H167=\"Weight\",$F167*VLOOKUP(\"Weight|\"&$G167,UOM_Conversions!$A$2:$E$50,4,FALSE),IF($H167=\"Volume\",$F167*VLOOKUP(\"Volume|\"&$G167,UOM_Conversions!$A$2:$E$50,4,FALSE),$F167*VLOOKUP(\"Each|\"&$G167,UOM_Conversions!$A$2:$E$50,4,FALSE))))","v":""},""]
[{"$nulls":9},{"$f":"IF($B168=\"\",\"\",IF($H168=\"Weight\",$F168*VLOOKUP(\"Weight|\"&$G168,UOM_Conversions!$A$2:$E$50,4,FALSE),IF($H168=\"Volume\",$F168*VLOOKUP(\"Volume|\"&$G168,UOM_Conversions!$A$2:$E$50,4,FALSE),$F168*VLOOKUP(\"Each|\"&$G168,UOM_Conversions!$A$2:$E$50,4,FALSE))))","v":""},""]
[{"$nulls":9},{"$f":"IF($B169=\"\",\"\",IF($H169=\"Weight\",$F169*VLOOKUP(\"Weight|\"&$G169,UOM_Conversions!$A$2:$E$50,4,FALSE),IF($H169=\"Volume\",$F169*VLOOKUP(\"Volume|\"&$G169,UOM_Conversions!$A$2:$E$50,4,FALSE),$F169*VLOOKUP(\"Each|\"&$G169,UOM_Conversions!$A$2:$E$50,4,FALSE))))","v":""},""]
[{"$nulls":9},{"$f":"IF($B170=\"\",\"\",IF($H170=\"Weight\",$F170*VLOOKUP(\"Weight|\"&$G170,UOM_Conversions!$A$2:$E$50,4,FALSE),IF($H170=\"Volume\",$F170*VLOOKUP(\"Volume|\"&$G170,UOM_Conversions!$A$2:$E$50,4,FALSE),$F170*VLOOKUP(\"Each|\"&$G170,UOM_Conversions!$A$2:$E$50,4,FALSE))))","v":""},""]
[{"$nulls":9},{"$f":"IF($B171=\"\",\"\",IF($H171=\"Weight\",$F171*VLOOKUP(\"Weight|\"&$G171,UOM_Conversions!$A$2:$E$50,4,FALSE),IF($H171=\"Volume\",$F171*VLOOKUP(\"Volume|\"&$G171,UOM_Conversions!$A$2:$E$50,4,FALSE),$F171*VLOOKUP(\"Each|\"&$G171,UOM_Conversions!$A$2:$E$50,4,FALSE))))","v":""},""]
[{"$nulls":9},{"$f":"IF($B172=\"\",\"\",IF($H172=\"Weight\",$F172*VLOOKUP(\"Weight|\"&$G172,UOM_Conversions!$A$2:$E$50,4,FALSE),IF($H172=\"Volume\",$F172*VLOOKUP(\"Volume|\"&$G172,UOM_Conversions!$A$2:$E$50,4,FALSE),$F172*VLOOKUP(\"Each|\"&$G172,UOM_Conversions!$A$2:$E$50,4,FALSE))))","v":""},""]
[{"$nulls":9},{"$f":"IF($B173=\"\",\"\",IF($H173=\"Weight\",$F173*VLOOKUP(\"Weight|\"&$G173,UOM_Conversions!$A$2:$E$50,4,FALSE),IF($H173=\"Volume\",$F173*VLOOKUP(\"Volume|\"&$G173,UOM_Conversions!$A$2:$E$50,4,FALSE),$F173*VLOOKUP(\"Each|\"&$G173,UOM_Conversions!$A$2:$E$50,4,FALSE))))","v":""},""]
[{"$nulls":9},{"$f":"IF($B174=\"\",\"\",IF($H174=\"Weight\",$F174*VLOOKUP(\"Weight|\"&$G174,UOM_Conversions!$A$2:$E$50,4,FALSE),IF($H174=\"Volume\",$F174*VLOOKUP(\"Volume|\"&$G174,UOM_Conversions!$A$2:$E$50,4,FALSE),$F174*VLOOKUP(\"Each|\"&$G174,UOM_Conversions!$A$2:$E$50,4,FALSE))))","v":""},""]
[{"$nulls":9},{"$f":"IF($B175=\"\",\"\",IF($H175=\"Weight\",$F175*VLOOKUP(\"Weight|\"&$G175,UOM_Conversions!$A$2:$E$50,4,FALSE),IF($H175=\"Volume\",$F175*VLOOKUP(\"Volume|\"&$G175,UOM_Conversions!$A$2:$E$50,4,FALSE),$F175*VLOOKUP(\"Each|\"&$G175,UOM_Conversions!$A$2:$E$50,4,FALSE))))","v":""},""]
[{"$nulls":9},{"$f":"IF($B176=\"\",\"\",IF($H176=\"Weight\",$F176*VLOOKUP(\"Weight|\"&$G176,UOM_Conversions!$A$2:$E$50,4,FALSE),IF($H176=\"Volume\",$F176*VLOOKUP(\"Volume|\"&$G176,UOM_Conversions!$A$2:$E$50,4,FALSE),$F176*VLOOKUP(\"Each|\"&$G176,UOM_Conversions!$A$2:$E$50,4,FALSE))))","v":""},""]
[{"$nulls":9},{"$f":"IF($B177=\"\",\"\",IF($H177=\"Weight\",$F177*VLOOKUP(\"Weight|\"&$G177,UOM_Conversions!$A$2:$E$50,4,FALSE),IF($H177=\"Volume\",$F177*VLOOKUP(\"Volume|\"&$G177,UOM_Conversions!$A$2:$E$50,4,FALSE),$F177*VLOOKUP(\"Each|\"&$G177,UOM_Conversions!$A$2:$E$50,4,FALSE))))","v":""},""]
[{"$nulls":9},{"$f":"IF($B178=\"\",\"\",IF($H178=\"Weight\",$F178*VLOOKUP(\"Weight|\"&$G178,UOM_Conversions!$A$2:$E$50,4,FALSE),IF($H178=\"Volume\",$F178*VLOOKUP(\"Volume|\"&$G178,UOM_Conversions!$A$2:$E$50,4,FALSE),$F178*VLOOKUP(\"Each|\"&$G178,UOM_Conversions!$A$2:$E$50,4,FALSE))))","v":""},""]
[{"$nulls":9},{"$f":"IF($B179=\"\",\"\",IF($H179=\"Weight\",$F179*VLOOKUP(\"Weight|\"&$G179,UOM_Conversions!$A$2:$E$50,4,FALSE),IF($H179=\"Volume\",$F179*VLOOKUP(\"Volume|\"&$G179,UOM_Conversions!$A$2:$E$50,4,FALSE),$F179*VLOOKUP(\"Each|\"&$G179,UOM_Conversions!$A$2:$E$50,4,FALSE))))","v":""},""]
[{"$nulls":9},{"$f":"IF($B180=\"\",\"\",IF($H180=\"Weight\",$F180*VLOOKUP(\"Weight|\"&$G180,UOM_Conversions!$A$2:$E$50,4,FALSE),IF($H180=\"Volume\",$F180*VLOOKUP(\"Volume|\"&$G180,UOM_Conversions!$A$2:$E$50,4,FALSE),$F180*VLOOKUP(\"Each|\"&$G180,UOM_Conversions!$A$2:$E$50,4,FALSE))))","v":""},""]
[{"$nulls":9},{"$f":"IF($B181=\"\",\"\",IF($H181=\"Weight\",$F181*VLOOKUP(\"Weight|\"&$G181,UOM_Conversions!$A$2:$E$50,4,FALSE),IF($H181=\"Volume\",$F181*VLOOKUP(\"Volume|\"&$G181,UOM_Conversions!$A$2:$E$50,4,FALSE),$F181*VLOOKUP(\"Each|\"&$G181,UOM_Conversions!$A$2:$E$50,4,FALSE))))","v":""},""]
[{"$nulls":9},{"$f":"IF($B182=\"\",\"\",IF($H182=\"Weight\",$F182*VLOOKUP(\"Weight|\"&$G182,UOM_Conversions!$A$2:$E$50,4,FALSE),IF($H182=\"Volume\",$F182*VLOOKUP(\"Volume|\"&$G182,UOM_Conversions!$A$2:$E$50,4,FALSE),$F182*VLOOKUP(\"Each|\"&$G182,UOM_Conversions!$A$2:$E$50,4,FALSE))))","v":""},""]
[{"$nulls":9},{"$f":"IF($B183=\"\",\"\",IF($H183=\"Weight\",$F183*VLOOKUP(\"Weight|\"&$G183,UOM_Conversions!$A$2:$E$50,4,FALSE),IF($H183=\"Volume\",$F183*VLOOKUP(\"Volume|\"&$G183,UOM_Conversions!$A$2:$E$50,4,FALSE),$F183*VLOOKUP(\"Each|\"&$G183,UOM_Conversions!$A$2:$E$50,4,FALSE))))","v":""},""]
[{"$nulls":9},{"$f":"IF($B184=\"\",\"\",IF($H184=\"Weight\",$F184*VLOOKUP(\"Weight|\"&$G184,UOM_Conversions!$A$2:$E$50,4,FALSE),IF($H184=\"Volume\",$F184*VLOOKUP(\"Volume|\"&$G184,UOM_Conversions!$A$2:$E$50,4,FALSE),$F184*VLOOKUP(\"Each|\"&$G184,UOM_Conversions!$A$2:$E$50,4,FALSE))))","v":""},""]
[{"$nulls":9},{"$f":"IF($B185=\"\",\"\",IF($H185=\"Weight\",$F185*VLOOKUP(\"Weight|\"&$G185,UOM_Conversions!$A$2:$E$50,4,FALSE),IF($H185=\"Volume\",$F185*VLOOKUP(\"Volume|\"&$G185,UOM_Conversions!$A$2:$E$50,4,FALSE),$F185*VLOOKUP(\"Each|\"&$G185,UOM_Conversions!$A$2:$E$50,4,FALSE))))","v":""},""]
[{"$nulls":9},{"$f":"IF($B186=\"\",\"\",IF($H186=\"Weight\",$F186*VLOOKUP(\"Weight|\"&$G186,UOM_Conversions!$A$2:$E$50,4,FALSE),IF($H186=\"Volume\",$F186*VLOOKUP(\"Volume|\"&$G186,UOM_Conversions!$A$2:$E$50,4,FALSE),$F186*VLOOKUP(\"Each|\"&$G186,UOM_Conversions!$A$2:$E$50,4,FALSE))))","v":""},""]
[{"$nulls":9},{"$f":"IF($B187=\"\",\"\",IF($H187=\"Weight\",$F187*VLOOKUP(\"Weight|\"&$G187,UOM_Conversions!$A$2:$E$50,4,FALSE),IF($H187=\"Volume\",$F187*VLOOKUP(\"Volume|\"&$G187,UOM_Conversions!$A$2:$E$50,4,FALSE),$F187*VLOOKUP(\"Each|\"&$G187,UOM_Conversions!$A$2:$E$50,4,FALSE))))","v":""},""]
[{"$nulls":9},{"$f":"IF($B188=\"\",\"\",IF($H188=\"Weight\",$F188*VLOOKUP(\"Weight|\"&$G188,UOM_Conversions!$A$2:$E$50,4,FALSE),IF($H188=\"Volume\",$F188*VLOOKUP(\"Volume|\"&$G188,UOM_Conversions!$A$2:$E$50,4,FALSE),$F188*VLOOKUP(\"Each|\"&$G188,UOM_Conversions!$A$2:$E$50,4,FALSE))))","v":""},""]
[{"$nulls":9},{"$f":"IF($B189=\"\",\"\",IF($H189=\"Weight\",$F189*VLOOKUP(\"Weight|\"&$G189,UOM_Conversions!$A$2:$E$50,4,FALSE),IF($H189=\"Volume\",$F189*VLOOKUP(\"Volume|\"&$G189,UOM_Conversions!$A$2:$E$50,4,FALSE),$F189*VLOOKUP(\"Each|\"&$G189,UOM_Conversions!$A$2:$E$50,4,FALSE))))","v":""},""]
[{"$nulls":9},{"$f":"IF($B190=\"\",\"\",IF($H190=\"Weight\",$F190*VLOOKUP(\"Weight|\"&$G190,UOM_Conversions!$A$2:$E$50,4,FALSE),IF($H190=\"Volume\",$F190*VLOOKUP(\"Volume|\"&$G190,UOM_Conversions!$A$2:$E$50,4,FALSE),$F190*VLOOKUP(\"Each|\"&$G190,UOM_Conversions!$A$2:$E$50,4,FALSE))))","v":""},""]
[{"$nulls":9},{"$f":"IF($B191=\"\",\"\",IF($H191=\"Weight\",$F191*VLOOKUP(\"Weight|\"&$G191,UOM_Conversions!$A$2:$E$50,4,FALSE),IF($H191=\"Volume\",$F191*VLOOKUP(\"Volume|\"&$G191,UOM_Conversions!$A$2:$E$50,4,FALSE),$F191*VLOOKUP(\"Each|\"&$G191,UOM_Conversions!$A$2:$E$50,4,FALSE))))","v":""},""]
[{"$nulls":9},{"$f":"IF($B192=\"\",\"\",IF($H192=\"Weight\",$F192*VLOOKUP(\"Weight|\"&$G192,UOM_Conversions!$A$2:$E$50,4,FALSE),IF($H192=\"Volume\",$F192*VLOOKUP(\"Volume|\"&$G192,UOM_Conversions!$A$2:$E$50,4,FALSE),$F192*VLOOKUP(\"Each|\"&$G192,UOM_Conversions!$A$2:$E$50,4,FALSE))))","v":""},""]
[{"$nulls":9},{"$f":"IF($B193=\"\",\"\",IF($H193=\"Weight\",$F193*VLOOKUP(\"Weight|\"&$G193,UOM_Conversions!$A$2:$E$50,4,FALSE),IF($H193=\"Volume\",$F193*VLOOKUP(\"Volume|\"&$G193,UOM_Conversions!$A$2:$E$50,4,FALSE),$F193*VLOOKUP(\"Each|\"&$G193,UOM_Conversions!$A$2:$E$50,4,FALSE))))","v":""},""]
[{"$nulls":9},{"$f":"IF($B194=\"\",\"\",IF($H194=\"Weight\",$F194*VLOOKUP(\"Weight|\"&$G194,UOM_Conversions!$A$2:$E$50,4,FALSE),IF($H194=\"Volume\",$F194*VLOOKUP(\"Volume|\"&$G194,UOM_Conversions!$A$2:$E$50,4,FALSE),$F194*VLOOKUP(\"Each|\"&$G194,UOM_Conversions!$A$2:$E$50,4,FALSE))))","v":""},{"$f":"IF($B194=\"\",\"\",IFERROR($E194/$J194,0))","v":""}]
[{"$nulls":9},{"$f":"IF($B195=\"\",\"\",IF($H195=\"Weight\",$F195*VLOOKUP(\"Weight|\"&$G195,UOM_Conversions!$A$2:$E$50,4,FALSE),IF($H195=\"Volume\",$F195*VLOOKUP(\"Volume|\"&$G195,UOM_Conversions!$A$2:$E$50,4,FALSE),$F195*VLOOKUP(\"Each|\"&$G195,UOM_Conversions!$A$2:$E$50,4,FALSE))))","v":""},""]
[{"$nulls":9},{"$f":"IF($B196=\"\",\"\",IF($H196=\"Weight\",$F196*VLOOKUP(\"Weight|\"&$G196,UOM_Conversions!$A$2:$E$50,4,FALSE),IF($H196=\"Volume\",$F196*VLOOKUP(\"Volume|\"&$G196,UOM_Conversions!$A$2:$E$50,4,FALSE),$F196*VLOOKUP(\"Each|\"&$G196,UOM_Conversions!$A$2:$E$50,4,FALSE))))","v":""},""]
[{"$nulls":9},{"$f":"IF($B197=\"\",\"\",IF($H197=\"Weight\",$F197*VLOOKUP(\"Weight|\"&$G197,UOM_Conversions!$A$2:$E$50,4,FALSE),IF($H197=\"Volume\",$F197*VLOOKUP(\"Volume|\"&$G197,UOM_Conversions!$A$2:$E$50,4,FALSE),$F197*VLOOKUP(\"Each|\"&$G197,UOM_Conversions!$A$2:$E$50,4,FALSE))))","v":""},""]
[{"$nulls":9},{"$f":"IF($B198=\"\",\"\",IF($H198=\"Weight\",$F198*VLOOKUP(\"Weight|\"&$G198,UOM_Conversions!$A$2:$E$50,4,FALSE),IF($H198=\"Volume\",$F198*VLOOKUP(\"Volume|\"&$G198,UOM_Conversions!$A$2:$E$50,4,FALSE),$F198*VLOOKUP(\"Each|\"&$G198,UOM_Conversions!$A$2:$E$50,4,FALSE))))","v":""},""]
[{"$nulls":9},{"$f":"IF($B199=\"\",\"\",IF($H199=\"Weight\",$F199*VLOOKUP(\"Weight|\"&$G199,UOM_Conversions!$A$2:$E$50,4,FALSE),IF($H199=\"Volume\",$F199*VLOOKUP(\"Volume|\"&$G199,UOM_Conversions!$A$2:$E$50,4,FALSE),$F199*VLOOKUP(\"Each|\"&$G199,UOM_Conversions!$A$2:$E$50,4,FALSE))))","v":""},""]
[{"$nulls":9},{"$f":"IF($B200=\"\",\"\",IF($H200=\"Weight\",$F200*VLOOKUP(\"Weight|\"&$G200,UOM_Conversions!$A$2:$E$50,4,FALSE),IF($H200=\"Volume\",$F200*VLOOKUP(\"Volume|\"&$G200,UOM_Conversions!$A$2:$E$50,4,FALSE),$F200*VLOOKUP(\"Each|\"&$G200,UOM_Conversions!$A$2:$E$50,4,FALSE))))","v":""},""]
[{"$nulls":9},{"$f":"IF($B201=\"\",\"\",IF($H201=\"Weight\",$F201*VLOOKUP(\"Weight|\"&$G201,UOM_Conversions!$A$2:$E$50,4,FALSE),IF($H201=\"Volume\",$F201*VLOOKUP(\"Volume|\"&$G201,UOM_Conversions!$A$2:$E$50,4,FALSE),$F201*VLOOKUP(\"Each|\"&$G201,UOM_Conversions!$A$2:$E$50,4,FALSE))))","v":""},""]
[{"$nulls":9},{"$f":"IF($B202=\"\",\"\",IF($H202=\"Weight\",$F202*VLOOKUP(\"Weight|\"&$G202,UOM_Conversions!$A$2:$E$50,4,FALSE),IF($H202=\"Volume\",$F202*VLOOKUP(\"Volume|\"&$G202,UOM_Conversions!$A$2:$E$50,4,FALSE),$F202*VLOOKUP(\"Each|\"&$G202,UOM_Conversions!$A$2:$E$50,4,FALSE))))","v":""},""]
[{"$nulls":9},{"$f":"IF($B203=\"\",\"\",IF($H203=\"Weight\",$F203*VLOOKUP(\"Weight|\"&$G203,UOM_Conversions!$A$2:$E$50,4,FALSE),IF($H203=\"Volume\",$F203*VLOOKUP(\"Volume|\"&$G203,UOM_Conversions!$A$2:$E$50,4,FALSE),$F203*VLOOKUP(\"Each|\"&$G203,UOM_Conversions!$A$2:$E$50,4,FALSE))))","v":""},""]
[{"$nulls":9},{"$f":"IF($B204=\"\",\"\",IF($H204=\"Weight\",$F204*VLOOKUP(\"Weight|\"&$G204,UOM_Conversions!$A$2:$E$50,4,FALSE),IF($H204=\"Volume\",$F204*VLOOKUP(\"Volume|\"&$G204,UOM_Conversions!$A$2:$E$50,4,FALSE),$F204*VLOOKUP(\"Each|\"&$G204,UOM_Conversions!$A$2:$E$50,4,FALSE))))","v":""},""]
[{"$nulls":9},{"$f":"IF($B205=\"\",\"\",IF($H205=\"Weight\",$F205*VLOOKUP(\"Weight|\"&$G205,UOM_Conversions!$A$2:$E$50,4,FALSE),IF($H205=\"Volume\",$F205*VLOOKUP(\"Volume|\"&$G205,UOM_Conversions!$A$2:$E$50,4,FALSE),$F205*VLOOKUP(\"Each|\"&$G205,UOM_Conversions!$A$2:$E$50,4,FALSE))))","v":""},""]
[{"$nulls":9},{"$f":"IF($B206=\"\",\"\",IF($H206=\"Weight\",$F206*VLOOKUP(\"Weight|\"&$G206,UOM_Conversions!$A$2:$E$50,4,FALSE),IF($H206=\"Volume\",$F206*VLOOKUP(\"Volume|\"&$G206,UOM_Conversions!$A$2:$E$50,4,FALSE),$F206*VLOOKUP(\"Each|\"&$G206,UOM_Conversions!$A$2:$E$50,4,FALSE))))","v":""},""]
[{"$nulls":9},{"$f":"IF($B207=\"\",\"\",IF($H207=\"Weight\",$F207*VLOOKUP(\"Weight|\"&$G207,UOM_Conversions!$A$2:$E$50,4,FALSE),IF($H207=\"Volume\",$F207*VLOOKUP(\"Volume|\"&$G207,UOM_Conversions!$A$2:$E$50,4,FALSE),$F207*VLOOKUP(\"Each|\"&$G207,UOM_Conversions!$A$2:$E$50,4,FALSE))))","v":""},""]
[{"$nulls":9},{"$f":"IF($B208=\"\",\"\",IF($H208=\"Weight\",$F208*VLOOKUP(\"Weight|\"&$G208,UOM_Conversions!$A$2:$E$50,4,FALSE),IF($H208=\"Volume\",$F208*VLOOKUP(\"Volume|\"&$G208,UOM_Conversions!$A$2:$E$50,4,FALSE),$F208*VLOOKUP(\"Each|\"&$G208,UOM_Conversions!$A$2:$E$50,4,FALSE))))","v":""},""]
[{"$nulls":9},{"$f":"IF($B209=\"\",\"\",IF($H209=\"Weight\",$F209*VLOOKUP(\"Weight|\"&$G209,UOM_Conversions!$A$2:$E$50,4,FALSE),IF($H209=\"Volume\",$F209*VLOOKUP(\"Volume|\"&$G209,UOM_Conversions!$A$2:$E$50,4,FALSE),$F209*VLOOKUP(\"Each|\"&$G209,UOM_Conversions!$A$2:$E$50,4,FALSE))))","v":""},""]
[{"$nulls":9},{"$f":"IF($B210=\"\",\"\",IF($H210=\"Weight\",$F210*VLOOKUP(\"Weight|\"&$G210,UOM_Conversions!$A$2:$E$50,4,FALSE),IF($H210=\"Volume\",$F210*VLOOKUP(\"Volume|\"&$G210,UOM_Conversions!$A$2:$E$50,4,FALSE),$F210*VLOOKUP(\"Each|\"&$G210,UOM_Conversions!$A$2:$E$50,4,FALSE))))","v":""},""]
[{"$nulls":9},{"$f":"IF($B211=\"\",\"\",IF($H211=\"Weight\",$F211*VLOOKUP(\"Weight|\"&$G211,UOM_Conversions!$A$2:$E$50,4,FALSE),IF($H211=\"Volume\",$F211*VLOOKUP(\"Volume|\"&$G211,UOM_Conversions!$A$2:$E$50,4,FALSE),$F211*VLOOKUP(\"Each|\"&$G211,UOM_Conversions!$A$2:$E$50,4,FALSE))))","v":""},""]
[{"$nulls":9},{"$f":"IF($B212=\"\",\"\",IF($H212=\"Weight\",$F212*VLOOKUP(\"Weight|\"&$G212,UOM_Conversions!$A$2:$E$50,4,FALSE),IF($H212=\"Volume\",$F212*VLOOKUP(\"Volume|\"&$G212,UOM_Conversions!$A$2:$E$50,4,FALSE),$F212*VLOOKUP(\"Each|\"&$G212,UOM_Conversions!$A$2:$E$50,4,FALSE))))","v":""},""]
[{"$nulls":9},{"$f":"IF($B213=\"\",\"\",IF($H213=\"Weight\",$F213*VLOOKUP(\"Weight|\"&$G213,UOM_Conversions!$A$2:$E$50,4,FALSE),IF($H213=\"Volume\",$F213*VLOOKUP(\"Volume|\"&$G213,UOM_Conversions!$A$2:$E$50,4,FALSE),$F213*VLOOKUP(\"Each|\"&$G213,UOM_Conversions!$A$2:$E$50,4,FALSE))))","v":""},""]
[{"$nulls":9},{"$f":"IF($B214=\"\",\"\",IF($H214=\"Weight\",$F214*VLOOKUP(\"Weight|\"&$G214,UOM_Conversions!$A$2:$E$50,4,FALSE),IF($H214=\"Volume\",$F214*VLOOKUP(\"Volume|\"&$G214,UOM_Conversions!$A$2:$E$50,4,FALSE),$F214*VLOOKUP(\"Each|\"&$G214,UOM_Conversions!$A$2:$E$50,4,FALSE))))","v":""},""]
[{"$nulls":9},{"$f":"IF($B215=\"\",\"\",IF($H215=\"Weight\",$F215*VLOOKUP(\"Weight|\"&$G215,UOM_Conversions!$A$2:$E$50,4,FALSE),IF($H215=\"Volume\",$F215*VLOOKUP(\"Volume|\"&$G215,UOM_Conversions!$A$2:$E$50,4,FALSE),$F215*VLOOKUP(\"Each|\"&$G215,UOM_Conversions!$A$2:$E$50,4,FALSE))))","v":""},""]
[{"$nulls":9},{"$f":"IF($B216=\"\",\"\",IF($H216=\"Weight\",$F216*VLOOKUP(\"Weight|\"&$G216,UOM_Conversions!$A$2:$E$50,4,FALSE),IF($H216=\"Volume\",$F216*VLOOKUP(\"Volume|\"&$G216,UOM_Conversions!$A$2:$E$50,4,FALSE),$F216*VLOOKUP(\"Each|\"&$G216,UOM_Conversions!$A$2:$E$50,4,FALSE))))","v":""},""]
[{"$nulls":9},{"$f":"IF($B217=\"\",\"\",IF($H217=\"Weight\",$F217*VLOOKUP(\"Weight|\"&$G217,UOM_Conversions!$A$2:$E$50,4,FALSE),IF($H217=\"Volume\",$F217*VLOOKUP(\"Volume|\"&$G217,UOM_Conversions!$A$2:$E$50,4,FALSE),$F217*VLOOKUP(\"Each|\"&$G217,UOM_Conversions!$A$2:$E$50,4,FALSE))))","v":""},""]
[{"$nulls":9},{"$f":"IF($B218=\"\",\"\",IF($H218=\"Weight\",$F218*VLOOKUP(\"Weight|\"&$G218,UOM_Conversions!$A$2:$E$50,4,FALSE),IF($H218=\"Volume\",$F218*VLOOKUP(\"Volume|\"&$G218,UOM_Conversions!$A$2:$E$50,4,FALSE),$F218*VLOOKUP(\"Each|\"&$G218,UOM_Conversions!$A$2:$E$50,4,FALSE))))","v":""},""]
[{"$nulls":9},{"$f":"IF($B219=\"\",\"\",IF($H219=\"Weight\",$F219*VLOOKUP(\"Weight|\"&$G219,UOM_Conversions!$A$2:$E$50,4,FALSE),IF($H219=\"Volume\",$F219*VLOOKUP(\"Volume|\"&$G219,UOM_Conversions!$A$2:$E$50,4,FALSE),$F219*VLOOKUP(\"Each|\"&$G219,UOM_Conversions!$A$2:$E$50,4,FALSE))))","v":""},""]
[{"$nulls":9},{"$f":"IF($B220=\"\",\"\",IF($H220=\"Weight\",$F220*VLOOKUP(\"Weight|\"&$G220,UOM_Conversions!$A$2:$E$50,4,FALSE),IF($H220=\"Volume\",$F220*VLOOKUP(\"Volume|\"&$G220,UOM_Conversions!$A$2:$E$50,4,FALSE),$F220*VLOOKUP(\"Each|\"&$G220,UOM_Conversions!$A$2:$E$50,4,FALSE))))","v":""},""]
[{"$nulls":9},{"$f":"IF($B221=\"\",\"\",IF($H221=\"Weight\",$F221*VLOOKUP(\"Weight|\"&$G221,UOM_Conversions!$A$2:$E$50,4,FALSE),IF($H221=\"Volume\",$F221*VLOOKUP(\"Volume|\"&$G221,UOM_Conversions!$A$2:$E$50,4,FALSE),$F221*VLOOKUP(\"Each|\"&$G221,UOM_Conversions!$A$2:$E$50,4,FALSE))))","v":""},""]
[{"$nulls":9},{"$f":"IF($B222=\"\",\"\",IF($H222=\"Weight\",$F222*VLOOKUP(\"Weight|\"&$G222,UOM_Conversions!$A$2:$E$50,4,FALSE),IF($H222=\"Volume\",$F222*VLOOKUP(\"Volume|\"&$G222,UOM_Conversions!$A$2:$E$50,4,FALSE),$F222*VLOOKUP(\"Each|\"&$G222,UOM_Conversions!$A$2:$E$50,4,FALSE))))","v":""},""]
[{"$nulls":9},{"$f":"IF($B223=\"\",\"\",IF($H223=\"Weight\",$F223*VLOOKUP(\"Weight|\"&$G223,UOM_Conversions!$A$2:$E$50,4,FALSE),IF($H223=\"Volume\",$F223*VLOOKUP(\"Volume|\"&$G223,UOM_Conversions!$A$2:$E$50,4,FALSE),$F223*VLOOKUP(\"Each|\"&$G223,UOM_Conversions!$A$2:$E$50,4,FALSE))))","v":""},""]
[{"$nulls":9},{"$f":"IF($B224=\"\",\"\",IF($H224=\"Weight\",$F224*VLOOKUP(\"Weight|\"&$G224,UOM_Conversions!$A$2:$E$50,4,FALSE),IF($H224=\"Volume\",$F224*VLOOKUP(\"Volume|\"&$G224,UOM_Conversions!$A$2:$E$50,4,FALSE),$F224*VLOOKUP(\"Each|\"&$G224,UOM_Conversions!$A$2:$E$50,4,FALSE))))","v":""},""]
[{"$nulls":9},{"$f":"IF($B225=\"\",\"\",IF($H225=\"Weight\",$F225*VLOOKUP(\"Weight|\"&$G225,UOM_Conversions!$A$2:$E$50,4,FALSE),IF($H225=\"Volume\",$F225*VLOOKUP(\"Volume|\"&$G225,UOM_Conversions!$A$2:$E$50,4,FALSE),$F225*VLOOKUP(\"Each|\"&$G225,UOM_Conversions!$A$2:$E$50,4,FALSE))))","v":""},""]
[{"$nulls":9},{"$f":"IF($B226=\"\",\"\",IF($H226=\"Weight\",$F226*VLOOKUP(\"Weight|\"&$G226,UOM_Conversions!$A$2:$E$50,4,FALSE),IF($H226=\"Volume\",$F226*VLOOKUP(\"Volume|\"&$G226,UOM_Conversions!$A$2:$E$50,4,FALSE),$F226*VLOOKUP(\"Each|\"&$G226,UOM_Conversions!$A$2:$E$50,4,FALSE))))","v":""},""]
[{"$nulls":9},{"$f":"IF($B227=\"\",\"\",IF($H227=\"Weight\",$F227*VLOOKUP(\"Weight|\"&$G227,UOM_Conversions!$A$2:$E$50,4,FALSE),IF($H227=\"Volume\",$F227*VLOOKUP(\"Volume|\"&$G227,UOM_Conversions!$A$2:$E$50,4,FALSE),$F227*VLOOKUP(\"Each|\"&$G227,UOM_Conversions!$A$2:$E$50,4,FALSE))))","v":""},""]
[{"$nulls":9},{"$f":"IF($B228=\"\",\"\",IF($H228=\"Weight\",$F228*VLOOKUP(\"Weight|\"&$G228,UOM_Conversions!$A$2:$E$50,4,FALSE),IF($H228=\"Volume\",$F228*VLOOKUP(\"Volume|\"&$G228,UOM_Conversions!$A$2:$E$50,4,FALSE),$F228*VLOOKUP(\"Each|\"&$G228,UOM_Conversions!$A$2:$E$50,4,FALSE))))","v":""},""]
[{"$nulls":9},{"$f":"IF($B229=\"\",\"\",IF($H229=\"Weight\",$F229*VLOOKUP(\"Weight|\"&$G229,UOM_Conversions!$A$2:$E$50,4,FALSE),IF($H229=\"Volume\",$F229*VLOOKUP(\"Volume|\"&$G229,UOM_Conversions!$A$2:$E$50,4,FALSE),$F229*VLOOKUP(\"Each|\"&$G229,UOM_Conversions!$A$2:$E$50,4,FALSE))))","v":""},""]
[{"$nulls":9},{"$f":"IF($B230=\"\",\"\",IF($H230=\"Weight\",$F230*VLOOKUP(\"Weight|\"&$G230,UOM_Conversions!$A$2:$E$50,4,FALSE),IF($H230=\"Volume\",$F230*VLOOKUP(\"Volume|\"&$G230,UOM_Conversions!$A$2:$E$50,4,FALSE),$F230*VLOOKUP(\"Each|\"&$G230,UOM_Conversions!$A$2:$E$50,4,FALSE))))","v":""},""]
[{"$nulls":9},{"$f":"IF($B231=\"\",\"\",IF($H231=\"Weight\",$F231*VLOOKUP(\"Weight|\"&$G231,UOM_Conversions!$A$2:$E$50,4,FALSE),IF($H231=\"Volume\",$F231*VLOOKUP(\"Volume|\"&$G231,UOM_Conversions!$A$2:$E$50,4,FALSE),$F231*VLOOKUP(\"Each|\"&$G231,UOM_Conversions!$A$2:$E$50,4,FALSE))))","v":""},""]
[{"$nulls":9},{"$f":"IF($B232=\"\",\"\",IF($H232=\"Weight\",$F232*VLOOKUP(\"Weight|\"&$G232,UOM_Conversions!$A$2:$E$50,4,FALSE),IF($H232=\"Volume\",$F232*VLOOKUP(\"Volume|\"&$G232,UOM_Conversions!$A$2:$E$50,4,FALSE),$F232*VLOOKUP(\"Each|\"&$G232,UOM_Conversions!$A$2:$E$50,4,FALSE))))","v":""},""]
[{"$nulls":9},{"$f":"IF($B233=\"\",\"\",IF($H233=\"Weight\",$F233*VLOOKUP(\"Weight|\"&$G233,UOM_Conversions!$A$2:$E$50,4,FALSE),IF($H233=\"Volume\",$F233*VLOOKUP(\"Volume|\"&$G233,UOM_Conversions!$A$2:$E$50,4,FALSE),$F233*VLOOKUP(\"Each|\"&$G233,UOM_Conversions!$A$2:$E$50,4,FALSE))))","v":""},""]
[{"$nulls":9},{"$f":"IF($B234=\"\",\"\",IF($H234=\"Weight\",$F234*VLOOKUP(\"Weight|\"&$G234,UOM_Conversions!$A$2:$E$50,4,FALSE),IF($H234=\"Volume\",$F234*VLOOKUP(\"Volume|\"&$G234,UOM_Conversions!$A$2:$E$50,4,FALSE),$F234*VLOOKUP(\"Each|\"&$G234,UOM_Conversions!$A$2:$E$50,4,FALSE))))","v":""},""]
[{"$nulls":9},{"$f":"IF($B235=\"\",\"\",IF($H235=\"Weight\",$F235*VLOOKUP(\"Weight|\"&$G235,UOM_Conversions!$A$2:$E$50,4,FALSE),IF($H235=\"Volume\",$F235*VLOOKUP(\"Volume|\"&$G235,UOM_Conversions!$A$2:$E$50,4,FALSE),$F235*VLOOKUP(\"Each|\"&$G235,UOM_Conversions!$A$2:$E$50,4,FALSE))))","v":""},""]
[{"$nulls":9},{"$f":"IF($B236=\"\",\"\",IF($H236=\"Weight\",$F236*VLOOKUP(\"Weight|\"&$G236,UOM_Conversions!$A$2:$E$50,4,FALSE),IF($H236=\"Volume\",$F236*VLOOKUP(\"Volume|\"&$G236,UOM_Conversions!$A$2:$E$50,4,FALSE),$F236*VLOOKUP(\"Each|\"&$G236,UOM_Conversions!$A$2:$E$50,4,FALSE))))","v":""},""]
[{"$nulls":9},{"$f":"IF($B237=\"\",\"\",IF($H237=\"Weight\",$F237*VLOOKUP(\"Weight|\"&$G237,UOM_Conversions!$A$2:$E$50,4,FALSE),IF($H237=\"Volume\",$F237*VLOOKUP(\"Volume|\"&$G237,UOM_Conversions!$A$2:$E$50,4,FALSE),$F237*VLOOKUP(\"Each|\"&$G237,UOM_Conversions!$A$2:$E$50,4,FALSE))))","v":""},""]
[{"$nulls":9},{"$f":"IF($B238=\"\",\"\",IF($H238=\"Weight\",$F238*VLOOKUP(\"Weight|\"&$G238,UOM_Conversions!$A$2:$E$50,4,FALSE),IF($H238=\"Volume\",$F238*VLOOKUP(\"Volume|\"&$G238,UOM_Conversions!$A$2:$E$50,4,FALSE),$F238*VLOOKUP(\"Each|\"&$G238,UOM_Conversions!$A$2:$E$50,4,FALSE))))","v":""},""]
[{"$nulls":9},{"$f":"IF($B239=\"\",\"\",IF($H239=\"Weight\",$F239*VLOOKUP(\"Weight|\"&$G239,UOM_Conversions!$A$2:$E$50,4,FALSE),IF($H239=\"Volume\",$F239*VLOOKUP(\"Volume|\"&$G239,UOM_Conversions!$A$2:$E$50,4,FALSE),$F239*VLOOKUP(\"Each|\"&$G239,UOM_Conversions!$A$2:$E$50,4,FALSE))))","v":""},""]
[{"$nulls":9},{"$f":"IF($B240=\"\",\"\",IF($H240=\"Weight\",$F240*VLOOKUP(\"Weight|\"&$G240,UOM_Conversions!$A$2:$E$50,4,FALSE),IF($H240=\"Volume\",$F240*VLOOKUP(\"Volume|\"&$G240,UOM_Conversions!$A$2:$E$50,4,FALSE),$F240*VLOOKUP(\"Each|\"&$G240,UOM_Conversions!$A$2:$E$50,4,FALSE))))","v":""},""]
[{"$nulls":9},{"$f":"IF($B241=\"\",\"\",IF($H241=\"Weight\",$F241*VLOOKUP(\"Weight|\"&$G241,UOM_Conversions!$A$2:$E$50,4,FALSE),IF($H241=\"Volume\",$F241*VLOOKUP(\"Volume|\"&$G241,UOM_Conversions!$A$2:$E$50,4,FALSE),$F241*VLOOKUP(\"Each|\"&$G241,UOM_Conversions!$A$2:$E$50,4,FALSE))))","v":""},""]
[{"$nulls":9},{"$f":"IF($B242=\"\",\"\",IF($H242=\"Weight\",$F242*VLOOKUP(\"Weight|\"&$G242,UOM_Conversions!$A$2:$E$50,4,FALSE),IF($H242=\"Volume\",$F242*VLOOKUP(\"Volume|\"&$G242,UOM_Conversions!$A$2:$E$50,4,FALSE),$F242*VLOOKUP(\"Each|\"&$G242,UOM_Conversions!$A$2:$E$50,4,FALSE))))","v":""},""]
[{"$nulls":9},{"$f":"IF($B243=\"\",\"\",IF($H243=\"Weight\",$F243*VLOOKUP(\"Weight|\"&$G243,UOM_Conversions!$A$2:$E$50,4,FALSE),IF($H243=\"Volume\",$F243*VLOOKUP(\"Volume|\"&$G243,UOM_Conversions!$A$2:$E$50,4,FALSE),$F243*VLOOKUP(\"Each|\"&$G243,UOM_Conversions!$A$2:$E$50,4,FALSE))))","v":""},""]
[{"$nulls":9},{"$f":"IF($B244=\"\",\"\",IF($H244=\"Weight\",$F244*VLOOKUP(\"Weight|\"&$G244,UOM_Conversions!$A$2:$E$50,4,FALSE),IF($H244=\"Volume\",$F244*VLOOKUP(\"Volume|\"&$G244,UOM_Conversions!$A$2:$E$50,4,FALSE),$F244*VLOOKUP(\"Each|\"&$G244,UOM_Conversions!$A$2:$E$50,4,FALSE))))","v":""},""]
[{"$nulls":9},{"$f":"IF($B245=\"\",\"\",IF($H245=\"Weight\",$F245*VLOOKUP(\"Weight|\"&$G245,UOM_Conversions!$A$2:$E$50,4,FALSE),IF($H245=\"Volume\",$F245*VLOOKUP(\"Volume|\"&$G245,UOM_Conversions!$A$2:$E$50,4,FALSE),$F245*VLOOKUP(\"Each|\"&$G245,UOM_Conversions!$A$2:$E$50,4,FALSE))))","v":""},""]
[{"$nulls":9},{"$f":"IF($B246=\"\",\"\",IF($H246=\"Weight\",$F246*VLOOKUP(\"Weight|\"&$G246,UOM_Conversions!$A$2:$E$50,4,FALSE),IF($H246=\"Volume\",$F246*VLOOKUP(\"Volume|\"&$G246,UOM_Conversions!$A$2:$E$50,4,FALSE),$F246*VLOOKUP(\"Each|\"&$G246,UOM_Conversions!$A$2:$E$50,4,FALSE))))","v":""},""]
[{"$nulls":9},{"$f":"IF($B247=\"\",\"\",IF($H247=\"Weight\",$F247*VLOOKUP(\"Weight|\"&$G247,UOM_Conversions!$A$2:$E$50,4,FALSE),IF($H247=\"Volume\",$F247*VLOOKUP(\"Volume|\"&$G247,UOM_Conversions!$A$2:$E$50,4,FALSE),$F247*VLOOKUP(\"Each|\"&$G247,UOM_Conversions!$A$2:$E$50,4,FALSE))))","v":""},""]
[{"$nulls":9},{"$f":"IF($B248=\"\",\"\",IF($H248=\"Weight\",$F248*VLOOKUP(\"Weight|\"&$G248,UOM_Conversions!$A$2:$E$50,4,FALSE),IF($H248=\"Volume\",$F248*VLOOKUP(\"Volume|\"&$G248,UOM_Conversions!$A$2:$E$50,4,FALSE),$F248*VLOOKUP(\"Each|\"&$G248,UOM_Conversions!$A$2:$E$50,4,FALSE))))","v":""},""]
[{"$nulls":9},{"$f":"IF($B249=\"\",\"\",IF($H249=\"Weight\",$F249*VLOOKUP(\"Weight|\"&$G249,UOM_Conversions!$A$2:$E$50,4,FALSE),IF($H249=\"Volume\",$F249*VLOOKUP(\"Volume|\"&$G249,UOM_Conversions!$A$2:$E$50,4,FALSE),$F249*VLOOKUP(\"Each|\"&$G249,UOM_Conversions!$A$2:$E$50,4,FALSE))))","v":""},""]
[{"$nulls":9},{"$f":"IF($B250=\"\",\"\",IF($H250=\"Weight\",$F250*VLOOKUP(\"Weight|\"&$G250,UOM_Conversions!$A$2:$E$50,4,FALSE),IF($H250=\"Volume\",$F250*VLOOKUP(\"Volume|\"&$G250,UOM_Conversions!$A$2:$E$50,4,FALSE),$F250*VLOOKUP(\"Each|\"&$G250,UOM_Conversions!$A$2:$E$50,4,FALSE))))","v":""},""]
[{"$nulls":9},{"$f":"IF($B251=\"\",\"\",IF($H251=\"Weight\",$F251*VLOOKUP(\"Weight|\"&$G251,UOM_Conversions!$A$2:$E$50,4,FALSE),IF($H251=\"Volume\",$F251*VLOOKUP(\"Volume|\"&$G251,UOM_Conversions!$A$2:$E$50,4,FALSE),$F251*VLOOKUP(\"Each|\"&$G251,UOM_Conversions!$A$2:$E$50,4,FALSE))))","v":""},""]
[{"$nulls":9},{"$f":"IF($B252=\"\",\"\",IF($H252=\"Weight\",$F252*VLOOKUP(\"Weight|\"&$G252,UOM_Conversions!$A$2:$E$50,4,FALSE),IF($H252=\"Volume\",$F252*VLOOKUP(\"Volume|\"&$G252,UOM_Conversions!$A$2:$E$50,4,FALSE),$F252*VLOOKUP(\"Each|\"&$G252,UOM_Conversions!$A$2:$E$50,4,FALSE))))","v":""},""]
[{"$nulls":9},{"$f":"IF($B253=\"\",\"\",IF($H253=\"Weight\",$F253*VLOOKUP(\"Weight|\"&$G253,UOM_Conversions!$A$2:$E$50,4,FALSE),IF($H253=\"Volume\",$F253*VLOOKUP(\"Volume|\"&$G253,UOM_Conversions!$A$2:$E$50,4,FALSE),$F253*VLOOKUP(\"Each|\"&$G253,UOM_Conversions!$A$2:$E$50,4,FALSE))))","v":""},""]
[{"$nulls":9},{"$f":"IF($B254=\"\",\"\",IF($H254=\"Weight\",$F254*VLOOKUP(\"Weight|\"&$G254,UOM_Conversions!$A$2:$E$50,4,FALSE),IF($H254=\"Volume\",$F254*VLOOKUP(\"Volume|\"&$G254,UOM_Conversions!$A$2:$E$50,4,FALSE),$F254*VLOOKUP(\"Each|\"&$G254,UOM_Conversions!$A$2:$E$50,4,FALSE))))","v":""},""]
[{"$nulls":9},{"$f":"IF($B255=\"\",\"\",IF($H255=\"Weight\",$F255*VLOOKUP(\"Weight|\"&$G255,UOM_Conversions!$A$2:$E$50,4,FALSE),IF($H255=\"Volume\",$F255*VLOOKUP(\"Volume|\"&$G255,UOM_Conversions!$A$2:$E$50,4,FALSE),$F255*VLOOKUP(\"Each|\"&$G255,UOM_Conversions!$A$2:$E$50,4,FALSE))))","v":""},""]
[{"$nulls":9},{"$f":"IF($B256=\"\",\"\",IF($H256=\"Weight\",$F256*VLOOKUP(\"Weight|\"&$G256,UOM_Conversions!$A$2:$E$50,4,FALSE),IF($H256=\"Volume\",$F256*VLOOKUP(\"Volume|\"&$G256,UOM_Conversions!$A$2:$E$50,4,FALSE),$F256*VLOOKUP(\"Each|\"&$G256,UOM_Conversions!$A$2:$E$50,4,FALSE))))","v":""},""]
[{"$nulls":9},{"$f":"IF($B257=\"\",\"\",IF($H257=\"Weight\",$F257*VLOOKUP(\"Weight|\"&$G257,UOM_Conversions!$A$2:$E$50,4,FALSE),IF($H257=\"Volume\",$F257*VLOOKUP(\"Volume|\"&$G257,UOM_Conversions!$A$2:$E$50,4,FALSE),$F257*VLOOKUP(\"Each|\"&$G257,UOM_Conversions!$A$2:$E$50,4,FALSE))))","v":""},""]
[{"$nulls":9},{"$f":"IF($B258=\"\",\"\",IF($H258=\"Weight\",$F258*VLOOKUP(\"Weight|\"&$G258,UOM_Conversions!$A$2:$E$50,4,FALSE),IF($H258=\"Volume\",$F258*VLOOKUP(\"Volume|\"&$G258,UOM_Conversions!$A$2:$E$50,4,FALSE),$F258*VLOOKUP(\"Each|\"&$G258,UOM_Conversions!$A$2:$E$50,4,FALSE))))","v":""},{"$f":"IF($B258=\"\",\"\",IFERROR($E258/$J258,0))","v":""}]
[{"$nulls":9},{"$f":"IF($B259=\"\",\"\",IF($H259=\"Weight\",$F259*VLOOKUP(\"Weight|\"&$G259,UOM_Conversions!$A$2:$E$50,4,FALSE),IF($H259=\"Volume\",$F259*VLOOKUP(\"Volume|\"&$G259,UOM_Conversions!$A$2:$E$50,4,FALSE),$F259*VLOOKUP(\"Each|\"&$G259,UOM_Conversions!$A$2:$E$50,4,FALSE))))","v":""},""]
[{"$nulls":9},{"$f":"IF($B260=\"\",\"\",IF($H260=\"Weight\",$F260*VLOOKUP(\"Weight|\"&$G260,UOM_Conversions!$A$2:$E$50,4,FALSE),IF($H260=\"Volume\",$F260*VLOOKUP(\"Volume|\"&$G260,UOM_Conversions!$A$2:$E$50,4,FALSE),$F260*VLOOKUP(\"Each|\"&$G260,UOM_Conversions!$A$2:$E$50,4,FALSE))))","v":""},""]
[{"$nulls":9},{"$f":"IF($B261=\"\",\"\",IF($H261=\"Weight\",$F261*VLOOKUP(\"Weight|\"&$G261,UOM_Conversions!$A$2:$E$50,4,FALSE),IF($H261=\"Volume\",$F261*VLOOKUP(\"Volume|\"&$G261,UOM_Conversions!$A$2:$E$50,4,FALSE),$F261*VLOOKUP(\"Each|\"&$G261,UOM_Conversions!$A$2:$E$50,4,FALSE))))","v":""},""]
[{"$nulls":9},{"$f":"IF($B262=\"\",\"\",IF($H262=\"Weight\",$F262*VLOOKUP(\"Weight|\"&$G262,UOM_Conversions!$A$2:$E$50,4,FALSE),IF($H262=\"Volume\",$F262*VLOOKUP(\"Volume|\"&$G262,UOM_Conversions!$A$2:$E$50,4,FALSE),$F262*VLOOKUP(\"Each|\"&$G262,UOM_Conversions!$A$2:$E$50,4,FALSE))))","v":""},""]
[{"$nulls":9},{"$f":"IF($B263=\"\",\"\",IF($H263=\"Weight\",$F263*VLOOKUP(\"Weight|\"&$G263,UOM_Conversions!$A$2:$E$50,4,FALSE),IF($H263=\"Volume\",$F263*VLOOKUP(\"Volume|\"&$G263,UOM_Conversions!$A$2:$E$50,4,FALSE),$F263*VLOOKUP(\"Each|\"&$G263,UOM_Conversions!$A$2:$E$50,4,FALSE))))","v":""},""]
[{"$nulls":9},{"$f":"IF($B264=\"\",\"\",IF($H264=\"Weight\",$F264*VLOOKUP(\"Weight|\"&$G264,UOM_Conversions!$A$2:$E$50,4,FALSE),IF($H264=\"Volume\",$F264*VLOOKUP(\"Volume|\"&$G264,UOM_Conversions!$A$2:$E$50,4,FALSE),$F264*VLOOKUP(\"Each|\"&$G264,UOM_Conversions!$A$2:$E$50,4,FALSE))))","v":""},""]
[{"$nulls":9},{"$f":"IF($B265=\"\",\"\",IF($H265=\"Weight\",$F265*VLOOKUP(\"Weight|\"&$G265,UOM_Conversions!$A$2:$E$50,4,FALSE),IF($H265=\"Volume\",$F265*VLOOKUP(\"Volume|\"&$G265,UOM_Conversions!$A$2:$E$50,4,FALSE),$F265*VLOOKUP(\"Each|\"&$G265,UOM_Conversions!$A$2:$E$50,4,FALSE))))","v":""},""]
[{"$nulls":9},{"$f":"IF($B266=\"\",\"\",IF($H266=\"Weight\",$F266*VLOOKUP(\"Weight|\"&$G266,UOM_Conversions!$A$2:$E$50,4,FALSE),IF($H266=\"Volume\",$F266*VLOOKUP(\"Volume|\"&$G266,UOM_Conversions!$A$2:$E$50,4,FALSE),$F266*VLOOKUP(\"Each|\"&$G266,UOM_Conversions!$A$2:$E$50,4,FALSE))))","v":""},""]
[{"$nulls":9},{"$f":"IF($B267=\"\",\"\",IF($H267=\"Weight\",$F267*VLOOKUP(\"Weight|\"&$G267,UOM_Conversions!$A$2:$E$50,4,FALSE),IF($H267=\"Volume\",$F267*VLOOKUP(\"Volume|\"&$G267,UOM_Conversions!$A$2:$E$50,4,FALSE),$F267*VLOOKUP(\"Each|\"&$G267,UOM_Conversions!$A$2:$E$50,4,FALSE))))","v":""},""]
[{"$nulls":9},{"$f":"IF($B268=\"\",\"\",IF($H268=\"Weight\",$F268*VLOOKUP(\"Weight|\"&$G268,UOM_Conversions!$A$2:$E$50,4,FALSE),IF($H268=\"Volume\",$F268*VLOOKUP(\"Volume|\"&$G268,UOM_Conversions!$A$2:$E$50,4,FALSE),$F268*VLOOKUP(\"Each|\"&$G268,UOM_Conversions!$A$2:$E$50,4,FALSE))))","v":""},""]
[{"$nulls":9},{"$f":"IF($B269=\"\",\"\",IF($H269=\"Weight\",$F269*VLOOKUP(\"Weight|\"&$G269,UOM_Conversions!$A$2:$E$50,4,FALSE),IF($H269=\"Volume\",$F269*VLOOKUP(\"Volume|\"&$G269,UOM_Conversions!$A$2:$E$50,4,FALSE),$F269*VLOOKUP(\"Each|\"&$G269,UOM_Conversions!$A$2:$E$50,4,FALSE))))","v":""},""]
[{"$nulls":9},{"$f":"IF($B270=\"\",\"\",IF($H270=\"Weight\",$F270*VLOOKUP(\"Weight|\"&$G270,UOM_Conversions!$A$2:$E$50,4,FALSE),IF($H270=\"Volume\",$F270*VLOOKUP(\"Volume|\"&$G270,UOM_Conversions!$A$2:$E$50,4,FALSE),$F270*VLOOKUP(\"Each|\"&$G270,UOM_Conversions!$A$2:$E$50,4,FALSE))))","v":""},""]
[{"$nulls":9},{"$f":"IF($B271=\"\",\"\",IF($H271=\"Weight\",$F271*VLOOKUP(\"Weight|\"&$G271,UOM_Conversions!$A$2:$E$50,4,FALSE),IF($H271=\"Volume\",$F271*VLOOKUP(\"Volume|\"&$G271,UOM_Conversions!$A$2:$E$50,4,FALSE),$F271*VLOOKUP(\"Each|\"&$G271,UOM_Conversions!$A$2:$E$50,4,FALSE))))","v":""},""]
[{"$nulls":9},{"$f":"IF($B272=\"\",\"\",IF($H272=\"Weight\",$F272*VLOOKUP(\"Weight|\"&$G272,UOM_Conversions!$A$2:$E$50,4,FALSE),IF($H272=\"Volume\",$F272*VLOOKUP(\"Volume|\"&$G272,UOM_Conversions!$A$2:$E$50,4,FALSE),$F272*VLOOKUP(\"Each|\"&$G272,UOM_Conversions!$A$2:$E$50,4,FALSE))))","v":""},""]
[{"$nulls":9},{"$f":"IF($B273=\"\",\"\",IF($H273=\"Weight\",$F273*VLOOKUP(\"Weight|\"&$G273,UOM_Conversions!$A$2:$E$50,4,FALSE),IF($H273=\"Volume\",$F273*VLOOKUP(\"Volume|\"&$G273,UOM_Conversions!$A$2:$E$50,4,FALSE),$F273*VLOOKUP(\"Each|\"&$G273,UOM_Conversions!$A$2:$E$50,4,FALSE))))","v":""},""]
[{"$nulls":9},{"$f":"IF($B274=\"\",\"\",IF($H274=\"Weight\",$F274*VLOOKUP(\"Weight|\"&$G274,UOM_Conversions!$A$2:$E$50,4,FALSE),IF($H274=\"Volume\",$F274*VLOOKUP(\"Volume|\"&$G274,UOM_Conversions!$A$2:$E$50,4,FALSE),$F274*VLOOKUP(\"Each|\"&$G274,UOM_Conversions!$A$2:$E$50,4,FALSE))))","v":""},""]
[{"$nulls":9},{"$f":"IF($B275=\"\",\"\",IF($H275=\"Weight\",$F275*VLOOKUP(\"Weight|\"&$G275,UOM_Conversions!$A$2:$E$50,4,FALSE),IF($H275=\"Volume\",$F275*VLOOKUP(\"Volume|\"&$G275,UOM_Conversions!$A$2:$E$50,4,FALSE),$F275*VLOOKUP(\"Each|\"&$G275,UOM_Conversions!$A$2:$E$50,4,FALSE))))","v":""},""]
[{"$nulls":9},{"$f":"IF($B276=\"\",\"\",IF($H276=\"Weight\",$F276*VLOOKUP(\"Weight|\"&$G276,UOM_Conversions!$A$2:$E$50,4,FALSE),IF($H276=\"Volume\",$F276*VLOOKUP(\"Volume|\"&$G276,UOM_Conversions!$A$2:$E$50,4,FALSE),$F276*VLOOKUP(\"Each|\"&$G276,UOM_Conversions!$A$2:$E$50,4,FALSE))))","v":""},""]
[{"$nulls":9},{"$f":"IF($B277=\"\",\"\",IF($H277=\"Weight\",$F277*VLOOKUP(\"Weight|\"&$G277,UOM_Conversions!$A$2:$E$50,4,FALSE),IF($H277=\"Volume\",$F277*VLOOKUP(\"Volume|\"&$G277,UOM_Conversions!$A$2:$E$50,4,FALSE),$F277*VLOOKUP(\"Each|\"&$G277,UOM_Conversions!$A$2:$E$50,4,FALSE))))","v":""},""]
[{"$nulls":9},{"$f":"IF($B278=\"\",\"\",IF($H278=\"Weight\",$F278*VLOOKUP(\"Weight|\"&$G278,UOM_Conversions!$A$2:$E$50,4,FALSE),IF($H278=\"Volume\",$F278*VLOOKUP(\"Volume|\"&$G278,UOM_Conversions!$A$2:$E$50,4,FALSE),$F278*VLOOKUP(\"Each|\"&$G278,UOM_Conversions!$A$2:$E$50,4,FALSE))))","v":""},""]
[{"$nulls":9},{"$f":"IF($B279=\"\",\"\",IF($H279=\"Weight\",$F279*VLOOKUP(\"Weight|\"&$G279,UOM_Conversions!$A$2:$E$50,4,FALSE),IF($H279=\"Volume\",$F279*VLOOKUP(\"Volume|\"&$G279,UOM_Conversions!$A$2:$E$50,4,FALSE),$F279*VLOOKUP(\"Each|\"&$G279,UOM_Conversions!$A$2:$E$50,4,FALSE))))","v":""},""]
[{"$nulls":9},{"$f":"IF($B280=\"\",\"\",IF($H280=\"Weight\",$F280*VLOOKUP(\"Weight|\"&$G280,UOM_Conversions!$A$2:$E$50,4,FALSE),IF($H280=\"Volume\",$F280*VLOOKUP(\"Volume|\"&$G280,UOM_Conversions!$A$2:$E$50,4,FALSE),$F280*VLOOKUP(\"Each|\"&$G280,UOM_Conversions!$A$2:$E$50,4,FALSE))))","v":""},""]
[{"$nulls":9},{"$f":"IF($B281=\"\",\"\",IF($H281=\"Weight\",$F281*VLOOKUP(\"Weight|\"&$G281,UOM_Conversions!$A$2:$E$50,4,FALSE),IF($H281=\"Volume\",$F281*VLOOKUP(\"Volume|\"&$G281,UOM_Conversions!$A$2:$E$50,4,FALSE),$F281*VLOOKUP(\"Each|\"&$G281,UOM_Conversions!$A$2:$E$50,4,FALSE))))","v":""},""]
[{"$nulls":9},{"$f":"IF($B282=\"\",\"\",IF($H282=\"Weight\",$F282*VLOOKUP(\"Weight|\"&$G282,UOM_Conversions!$A$2:$E$50,4,FALSE),IF($H282=\"Volume\",$F282*VLOOKUP(\"Volume|\"&$G282,UOM_Conversions!$A$2:$E$50,4,FALSE),$F282*VLOOKUP(\"Each|\"&$G282,UOM_Conversions!$A$2:$E$50,4,FALSE))))","v":""},""]
[{"$nulls":9},{"$f":"IF($B283=\"\",\"\",IF($H283=\"Weight\",$F283*VLOOKUP(\"Weight|\"&$G283,UOM_Conversions!$A$2:$E$50,4,FALSE),IF($H283=\"Volume\",$F283*VLOOKUP(\"Volume|\"&$G283,UOM_Conversions!$A$2:$E$50,4,FALSE),$F283*VLOOKUP(\"Each|\"&$G283,UOM_Conversions!$A$2:$E$50,4,FALSE))))","v":""},""]
[{"$nulls":9},{"$f":"IF($B284=\"\",\"\",IF($H284=\"Weight\",$F284*VLOOKUP(\"Weight|\"&$G284,UOM_Conversions!$A$2:$E$50,4,FALSE),IF($H284=\"Volume\",$F284*VLOOKUP(\"Volume|\"&$G284,UOM_Conversions!$A$2:$E$50,4,FALSE),$F284*VLOOKUP(\"Each|\"&$G284,UOM_Conversions!$A$2:$E$50,4,FALSE))))","v":""},""]
[{"$nulls":9},{"$f":"IF($B285=\"\",\"\",IF($H285=\"Weight\",$F285*VLOOKUP(\"Weight|\"&$G285,UOM_Conversions!$A$2:$E$50,4,FALSE),IF($H285=\"Volume\",$F285*VLOOKUP(\"Volume|\"&$G285,UOM_Conversions!$A$2:$E$50,4,FALSE),$F285*VLOOKUP(\"Each|\"&$G285,UOM_Conversions!$A$2:$E$50,4,FALSE))))","v":""},""]
[{"$nulls":9},{"$f":"IF($B286=\"\",\"\",IF($H286=\"Weight\",$F286*VLOOKUP(\"Weight|\"&$G286,UOM_Conversions!$A$2:$E$50,4,FALSE),IF($H286=\"Volume\",$F286*VLOOKUP(\"Volume|\"&$G286,UOM_Conversions!$A$2:$E$50,4,FALSE),$F286*VLOOKUP(\"Each|\"&$G286,UOM_Conversions!$A$2:$E$50,4,FALSE))))","v":""},""]
[{"$nulls":9},{"$f":"IF($B287=\"\",\"\",IF($H287=\"Weight\",$F287*VLOOKUP(\"Weight|\"&$G287,UOM_Conversions!$A$2:$E$50,4,FALSE),IF($H287=\"Volume\",$F287*VLOOKUP(\"Volume|\"&$G287,UOM_Conversions!$A$2:$E$50,4,FALSE),$F287*VLOOKUP(\"Each|\"&$G287,UOM_Conversions!$A$2:$E$50,4,FALSE))))","v":""},""]
[{"$nulls":9},{"$f":"IF($B288=\"\",\"\",IF($H288=\"Weight\",$F288*VLOOKUP(\"Weight|\"&$G288,UOM_Conversions!$A$2:$E$50,4,FALSE),IF($H288=\"Volume\",$F288*VLOOKUP(\"Volume|\"&$G288,UOM_Conversions!$A$2:$E$50,4,FALSE),$F288*VLOOKUP(\"Each|\"&$G288,UOM_Conversions!$A$2:$E$50,4,FALSE))))","v":""},""]
[{"$nulls":9},{"$f":"IF($B289=\"\",\"\",IF($H289=\"Weight\",$F289*VLOOKUP(\"Weight|\"&$G289,UOM_Conversions!$A$2:$E$50,4,FALSE),IF($H289=\"Volume\",$F289*VLOOKUP(\"Volume|\"&$G289,UOM_Conversions!$A$2:$E$50,4,FALSE),$F289*VLOOKUP(\"Each|\"&$G289,UOM_Conversions!$A$2:$E$50,4,FALSE))))","v":""},""]
[{"$nulls":9},{"$f":"IF($B290=\"\",\"\",IF($H290=\"Weight\",$F290*VLOOKUP(\"Weight|\"&$G290,UOM_Conversions!$A$2:$E$50,4,FALSE),IF($H290=\"Volume\",$F290*VLOOKUP(\"Volume|\"&$G290,UOM_Conversions!$A$2:$E$50,4,FALSE),$F290*VLOOKUP(\"Each|\"&$G290,UOM_Conversions!$A$2:$E$50,4,FALSE))))","v":""},""]
[{"$nulls":9},{"$f":"IF($B291=\"\",\"\",IF($H291=\"Weight\",$F291*VLOOKUP(\"Weight|\"&$G291,UOM_Conversions!$A$2:$E$50,4,FALSE),IF($H291=\"Volume\",$F291*VLOOKUP(\"Volume|\"&$G291,UOM_Conversions!$A$2:$E$50,4,FALSE),$F291*VLOOKUP(\"Each|\"&$G291,UOM_Conversions!$A$2:$E$50,4,FALSE))))","v":""},""]
[{"$nulls":9},{"$f":"IF($B292=\"\",\"\",IF($H292=\"Weight\",$F292*VLOOKUP(\"Weight|\"&$G292,UOM_Conversions!$A$2:$E$50,4,FALSE),IF($H292=\"Volume\",$F292*VLOOKUP(\"Volume|\"&$G292,UOM_Conversions!$A$2:$E$50,4,FALSE),$F292*VLOOKUP(\"Each|\"&$G292,UOM_Conversions!$A$2:$E$50,4,FALSE))))","v":""},""]
[{"$nulls":9},{"$f":"IF($B293=\"\",\"\",IF($H293=\"Weight\",$F293*VLOOKUP(\"Weight|\"&$G293,UOM_Conversions!$A$2:$E$50,4,FALSE),IF($H293=\"Volume\",$F293*VLOOKUP(\"Volume|\"&$G293,UOM_Conversions!$A$2:$E$50,4,FALSE),$F293*VLOOKUP(\"Each|\"&$G293,UOM_Conversions!$A$2:$E$50,4,FALSE))))","v":""},""]
[{"$nulls":9},{"$f":"IF($B294=\"\",\"\",IF($H294=\"Weight\",$F294*VLOOKUP(\"Weight|\"&$G294,UOM_Conversions!$A$2:$E$50,4,FALSE),IF($H294=\"Volume\",$F294*VLOOKUP(\"Volume|\"&$G294,UOM_Conversions!$A$2:$E$50,4,FALSE),$F294*VLOOKUP(\"Each|\"&$G294,UOM_Conversions!$A$2:$E$50,4,FALSE))))","v":""},""]
[{"$nulls":9},{"$f":"IF($B295=\"\",\"\",IF($H295=\"Weight\",$F295*VLOOKUP(\"Weight|\"&$G295,UOM_Conversions!$A$2:$E$50,4,FALSE),IF($H295=\"Volume\",$F295*VLOOKUP(\"Volume|\"&$G295,UOM_Conversions!$A$2:$E$50,4,FALSE),$F295*VLOOKUP(\"Each|\"&$G295,UOM_Conversions!$A$2:$E$50,4,FALSE))))","v":""},""]
[{"$nulls":9},{"$f":"IF($B296=\"\",\"\",IF($H296=\"Weight\",$F296*VLOOKUP(\"Weight|\"&$G296,UOM_Conversions!$A$2:$E$50,4,FALSE),IF($H296=\"Volume\",$F296*VLOOKUP(\"Volume|\"&$G296,UOM_Conversions!$A$2:$E$50,4,FALSE),$F296*VLOOKUP(\"Each|\"&$G296,UOM_Conversions!$A$2:$E$50,4,FALSE))))","v":""},""]
[{"$nulls":9},{"$f":"IF($B297=\"\",\"\",IF($H297=\"Weight\",$F297*VLOOKUP(\"Weight|\"&$G297,UOM_Conversions!$A$2:$E$50,4,FALSE),IF($H297=\"Volume\",$F297*VLOOKUP(\"Volume|\"&$G297,UOM_Conversions!$A$2:$E$50,4,FALSE),$F297*VLOOKUP(\"Each|\"&$G297,UOM_Conversions!$A$2:$E$50,4,FALSE))))","v":""},""]
[{"$nulls":9},{"$f":"IF($B298=\"\",\"\",IF($H298=\"Weight\",$F298*VLOOKUP(\"Weight|\"&$G298,UOM_Conversions!$A$2:$E$50,4,FALSE),IF($H298=\"Volume\",$F298*VLOOKUP(\"Volume|\"&$G298,UOM_Conversions!$A$2:$E$50,4,FALSE),$F298*VLOOKUP(\"Each|\"&$G298,UOM_Conversions!$A$2:$E$50,4,FALSE))))","v":""},""]
[{"$nulls":9},{"$f":"IF($B299=\"\",\"\",IF($H299=\"Weight\",$F299*VLOOKUP(\"Weight|\"&$G299,UOM_Conversions!$A$2:$E$50,4,FALSE),IF($H299=\"Volume\",$F299*VLOOKUP(\"Volume|\"&$G299,UOM_Conversions!$A$2:$E$50,4,FALSE),$F299*VLOOKUP(\"Each|\"&$G299,UOM_Conversions!$A$2:$E$50,4,FALSE))))","v":""},""]
[{"$nulls":9},{"$f":"IF($B300=\"\",\"\",IF($H300=\"Weight\",$F300*VLOOKUP(\"Weight|\"&$G300,UOM_Conversions!$A$2:$E$50,4,FALSE),IF($H300=\"Volume\",$F300*VLOOKUP(\"Volume|\"&$G300,UOM_Conversions!$A$2:$E$50,4,FALSE),$F300*VLOOKUP(\"Each|\"&$G300,UOM_Conversions!$A$2:$E$50,4,FALSE))))","v":""},""]
[{"$nulls":9},{"$f":"IF($B301=\"\",\"\",IF($H301=\"Weight\",$F301*VLOOKUP(\"Weight|\"&$G301,UOM_Conversions!$A$2:$E$50,4,FALSE),IF($H301=\"Volume\",$F301*VLOOKUP(\"Volume|\"&$G301,UOM_Conversions!$A$2:$E$50,4,FALSE),$F301*VLOOKUP(\"Each|\"&$G301,UOM_Conversions!$A$2:$E$50,4,FALSE))))","v":""},""]
[{"$nulls":9},{"$f":"IF($B302=\"\",\"\",IF($H302=\"Weight\",$F302*VLOOKUP(\"Weight|\"&$G302,UOM_Conversions!$A$2:$E$50,4,FALSE),IF($H302=\"Volume\",$F302*VLOOKUP(\"Volume|\"&$G302,UOM_Conversions!$A$2:$E$50,4,FALSE),$F302*VLOOKUP(\"Each|\"&$G302,UOM_Conversions!$A$2:$E$50,4,FALSE))))","v":""},""]
[{"$nulls":9},{"$f":"IF($B303=\"\",\"\",IF($H303=\"Weight\",$F303*VLOOKUP(\"Weight|\"&$G303,UOM_Conversions!$A$2:$E$50,4,FALSE),IF($H303=\"Volume\",$F303*VLOOKUP(\"Volume|\"&$G303,UOM_Conversions!$A$2:$E$50,4,FALSE),$F303*VLOOKUP(\"Each|\"&$G303,UOM_Conversions!$A$2:$E$50,4,FALSE))))","v":""},""]
[{"$nulls":9},{"$f":"IF($B304=\"\",\"\",IF($H304=\"Weight\",$F304*VLOOKUP(\"Weight|\"&$G304,UOM_Conversions!$A$2:$E$50,4,FALSE),IF($H304=\"Volume\",$F304*VLOOKUP(\"Volume|\"&$G304,UOM_Conversions!$A$2:$E$50,4,FALSE),$F304*VLOOKUP(\"Each|\"&$G304,UOM_Conversions!$A$2:$E$50,4,FALSE))))","v":""},""]
[{"$nulls":9},{"$f":"IF($B305=\"\",\"\",IF($H305=\"Weight\",$F305*VLOOKUP(\"Weight|\"&$G305,UOM_Conversions!$A$2:$E$50,4,FALSE),IF($H305=\"Volume\",$F305*VLOOKUP(\"Volume|\"&$G305,UOM_Conversions!$A$2:$E$50,4,FALSE),$F305*VLOOKUP(\"Each|\"&$G305,UOM_Conversions!$A$2:$E$50,4,FALSE))))","v":""},""]
[{"$nulls":9},{"$f":"IF($B306=\"\",\"\",IF($H306=\"Weight\",$F306*VLOOKUP(\"Weight|\"&$G306,UOM_Conversions!$A$2:$E$50,4,FALSE),IF($H306=\"Volume\",$F306*VLOOKUP(\"Volume|\"&$G306,UOM_Conversions!$A$2:$E$50,4,FALSE),$F306*VLOOKUP(\"Each|\"&$G306,UOM_Conversions!$A$2:$E$50,4,FALSE))))","v":""},""]
[{"$nulls":9},{"$f":"IF($B307=\"\",\"\",IF($H307=\"Weight\",$F307*VLOOKUP(\"Weight|\"&$G307,UOM_Conversions!$A$2:$E$50,4,FALSE),IF($H307=\"Volume\",$F307*VLOOKUP(\"Volume|\"&$G307,UOM_Conversions!$A$2:$E$50,4,FALSE),$F307*VLOOKUP(\"Each|\"&$G307,UOM_Conversions!$A$2:$E$50,4,FALSE))))","v":""},""]
[{"$nulls":9},{"$f":"IF($B308=\"\",\"\",IF($H308=\"Weight\",$F308*VLOOKUP(\"Weight|\"&$G308,UOM_Conversions!$A$2:$E$50,4,FALSE),IF($H308=\"Volume\",$F308*VLOOKUP(\"Volume|\"&$G308,UOM_Conversions!$A$2:$E$50,4,FALSE),$F308*VLOOKUP(\"Each|\"&$G308,UOM_Conversions!$A$2:$E$50,4,FALSE))))","v":""},""]
[{"$nulls":9},{"$f":"IF($B309=\"\",\"\",IF($H309=\"Weight\",$F309*VLOOKUP(\"Weight|\"&$G309,UOM_Conversions!$A$2:$E$50,4,FALSE),IF($H309=\"Volume\",$F309*VLOOKUP(\"Volume|\"&$G309,UOM_Conversions!$A$2:$E$50,4,FALSE),$F309*VLOOKUP(\"Each|\"&$G309,UOM_Conversions!$A$2:$E$50,4,FALSE))))","v":""},""]
[{"$nulls":9},{"$f":"IF($B310=\"\",\"\",IF($H310=\"Weight\",$F310*VLOOKUP(\"Weight|\"&$G310,UOM_Conversions!$A$2:$E$50,4,FALSE),IF($H310=\"Volume\",$F310*VLOOKUP(\"Volume|\"&$G310,UOM_Conversions!$A$2:$E$50,4,FALSE),$F310*VLOOKUP(\"Each|\"&$G310,UOM_Conversions!$A$2:$E$50,4,FALSE))))","v":""},""]
[{"$nulls":9},{"$f":"IF($B311=\"\",\"\",IF($H311=\"Weight\",$F311*VLOOKUP(\"Weight|\"&$G311,UOM_Conversions!$A$2:$E$50,4,FALSE),IF($H311=\"Volume\",$F311*VLOOKUP(\"Volume|\"&$G311,UOM_Conversions!$A$2:$E$50,4,FALSE),$F311*VLOOKUP(\"Each|\"&$G311,UOM_Conversions!$A$2:$E$50,4,FALSE))))","v":""},""]
[{"$nulls":9},{"$f":"IF($B312=\"\",\"\",IF($H312=\"Weight\",$F312*VLOOKUP(\"Weight|\"&$G312,UOM_Conversions!$A$2:$E$50,4,FALSE),IF($H312=\"Volume\",$F312*VLOOKUP(\"Volume|\"&$G312,UOM_Conversions!$A$2:$E$50,4,FALSE),$F312*VLOOKUP(\"Each|\"&$G312,UOM_Conversions!$A$2:$E$50,4,FALSE))))","v":""},""]
[{"$nulls":9},{"$f":"IF($B313=\"\",\"\",IF($H313=\"Weight\",$F313*VLOOKUP(\"Weight|\"&$G313,UOM_Conversions!$A$2:$E$50,4,FALSE),IF($H313=\"Volume\",$F313*VLOOKUP(\"Volume|\"&$G313,UOM_Conversions!$A$2:$E$50,4,FALSE),$F313*VLOOKUP(\"Each|\"&$G313,UOM_Conversions!$A$2:$E$50,4,FALSE))))","v":""},""]
[{"$nulls":9},{"$f":"IF($B314=\"\",\"\",IF($H314=\"Weight\",$F314*VLOOKUP(\"Weight|\"&$G314,UOM_Conversions!$A$2:$E$50,4,FALSE),IF($H314=\"Volume\",$F314*VLOOKUP(\"Volume|\"&$G314,UOM_Conversions!$A$2:$E$50,4,FALSE),$F314*VLOOKUP(\"Each|\"&$G314,UOM_Conversions!$A$2:$E$50,4,FALSE))))","v":""},""]
[{"$nulls":9},{"$f":"IF($B315=\"\",\"\",IF($H315=\"Weight\",$F315*VLOOKUP(\"Weight|\"&$G315,UOM_Conversions!$A$2:$E$50,4,FALSE),IF($H315=\"Volume\",$F315*VLOOKUP(\"Volume|\"&$G315,UOM_Conversions!$A$2:$E$50,4,FALSE),$F315*VLOOKUP(\"Each|\"&$G315,UOM_Conversions!$A$2:$E$50,4,FALSE))))","v":""},""]
[{"$nulls":9},{"$f":"IF($B316=\"\",\"\",IF($H316=\"Weight\",$F316*VLOOKUP(\"Weight|\"&$G316,UOM_Conversions!$A$2:$E$50,4,FALSE),IF($H316=\"Volume\",$F316*VLOOKUP(\"Volume|\"&$G316,UOM_Conversions!$A$2:$E$50,4,FALSE),$F316*VLOOKUP(\"Each|\"&$G316,UOM_Conversions!$A$2:$E$50,4,FALSE))))","v":""},""]
[{"$nulls":9},{"$f":"IF($B317=\"\",\"\",IF($H317=\"Weight\",$F317*VLOOKUP(\"Weight|\"&$G317,UOM_Conversions!$A$2:$E$50,4,FALSE),IF($H317=\"Volume\",$F317*VLOOKUP(\"Volume|\"&$G317,UOM_Conversions!$A$2:$E$50,4,FALSE),$F317*VLOOKUP(\"Each|\"&$G317,UOM_Conversions!$A$2:$E$50,4,FALSE))))","v":""},""]
[{"$nulls":9},{"$f":"IF($B318=\"\",\"\",IF($H318=\"Weight\",$F318*VLOOKUP(\"Weight|\"&$G318,UOM_Conversions!$A$2:$E$50,4,FALSE),IF($H318=\"Volume\",$F318*VLOOKUP(\"Volume|\"&$G318,UOM_Conversions!$A$2:$E$50,4,FALSE),$F318*VLOOKUP(\"Each|\"&$G318,UOM_Conversions!$A$2:$E$50,4,FALSE))))","v":""},""]
[{"$nulls":9},{"$f":"IF($B319=\"\",\"\",IF($H319=\"Weight\",$F319*VLOOKUP(\"Weight|\"&$G319,UOM_Conversions!$A$2:$E$50,4,FALSE),IF($H319=\"Volume\",$F319*VLOOKUP(\"Volume|\"&$G319,UOM_Conversions!$A$2:$E$50,4,FALSE),$F319*VLOOKUP(\"Each|\"&$G319,UOM_Conversions!$A$2:$E$50,4,FALSE))))","v":""},""]
[{"$nulls":9},{"$f":"IF($B320=\"\",\"\",IF($H320=\"Weight\",$F320*VLOOKUP(\"Weight|\"&$G320,UOM_Conversions!$A$2:$E$50,4,FALSE),IF($H320=\"Volume\",$F320*VLOOKUP(\"Volume|\"&$G320,UOM_Conversions!$A$2:$E$50,4,FALSE),$F320*VLOOKUP(\"Each|\"&$G320,UOM_Conversions!$A$2:$E$50,4,FALSE))))","v":""},""]
[{"$nulls":9},{"$f":"IF($B321=\"\",\"\",IF($H321=\"Weight\",$F321*VLOOKUP(\"Weight|\"&$G321,UOM_Conversions!$A$2:$E$50,4,FALSE),IF($H321=\"Volume\",$F321*VLOOKUP(\"Volume|\"&$G321,UOM_Conversions!$A$2:$E$50,4,FALSE),$F321*VLOOKUP(\"Each|\"&$G321,UOM_Conversions!$A$2:$E$50,4,FALSE))))","v":""},""]
[{"$nulls":9},{"$f":"IF($B322=\"\",\"\",IF($H322=\"Weight\",$F322*VLOOKUP(\"Weight|\"&$G322,UOM_Conversions!$A$2:$E$50,4,FALSE),IF($H322=\"Volume\",$F322*VLOOKUP(\"Volume|\"&$G322,UOM_Conversions!$A$2:$E$50,4,FALSE),$F322*VLOOKUP(\"Each|\"&$G322,UOM_Conversions!$A$2:$E$50,4,FALSE))))","v":""},{"$f":"IF($B322=\"\",\"\",IFERROR($E322/$J322,0))","v":""}]
[{"$nulls":9},{"$f":"IF($B323=\"\",\"\",IF($H323=\"Weight\",$F323*VLOOKUP(\"Weight|\"&$G323,UOM_Conversions!$A$2:$E$50,4,FALSE),IF($H323=\"Volume\",$F323*VLOOKUP(\"Volume|\"&$G323,UOM_Conversions!$A$2:$E$50,4,FALSE),$F323*VLOOKUP(\"Each|\"&$G323,UOM_Conversions!$A$2:$E$50,4,FALSE))))","v":""},""]
[{"$nulls":9},{"$f":"IF($B324=\"\",\"\",IF($H324=\"Weight\",$F324*VLOOKUP(\"Weight|\"&$G324,UOM_Conversions!$A$2:$E$50,4,FALSE),IF($H324=\"Volume\",$F324*VLOOKUP(\"Volume|\"&$G324,UOM_Conversions!$A$2:$E$50,4,FALSE),$F324*VLOOKUP(\"Each|\"&$G324,UOM_Conversions!$A$2:$E$50,4,FALSE))))","v":""},""]
[{"$nulls":9},{"$f":"IF($B325=\"\",\"\",IF($H325=\"Weight\",$F325*VLOOKUP(\"Weight|\"&$G325,UOM_Conversions!$A$2:$E$50,4,FALSE),IF($H325=\"Volume\",$F325*VLOOKUP(\"Volume|\"&$G325,UOM_Conversions!$A$2:$E$50,4,FALSE),$F325*VLOOKUP(\"Each|\"&$G325,UOM_Conversions!$A$2:$E$50,4,FALSE))))","v":""},""]
[{"$nulls":9},{"$f":"IF($B326=\"\",\"\",IF($H326=\"Weight\",$F326*VLOOKUP(\"Weight|\"&$G326,UOM_Conversions!$A$2:$E$50,4,FALSE),IF($H326=\"Volume\",$F326*VLOOKUP(\"Volume|\"&$G326,UOM_Conversions!$A$2:$E$50,4,FALSE),$F326*VLOOKUP(\"Each|\"&$G326,UOM_Conversions!$A$2:$E$50,4,FALSE))))","v":""},""]
[{"$nulls":9},{"$f":"IF($B327=\"\",\"\",IF($H327=\"Weight\",$F327*VLOOKUP(\"Weight|\"&$G327,UOM_Conversions!$A$2:$E$50,4,FALSE),IF($H327=\"Volume\",$F327*VLOOKUP(\"Volume|\"&$G327,UOM_Conversions!$A$2:$E$50,4,FALSE),$F327*VLOOKUP(\"Each|\"&$G327,UOM_Conversions!$A$2:$E$50,4,FALSE))))","v":""},""]
[{"$nulls":9},{"$f":"IF($B328=\"\",\"\",IF($H328=\"Weight\",$F328*VLOOKUP(\"Weight|\"&$G328,UOM_Conversions!$A$2:$E$50,4,FALSE),IF($H328=\"Volume\",$F328*VLOOKUP(\"Volume|\"&$G328,UOM_Conversions!$A$2:$E$50,4,FALSE),$F328*VLOOKUP(\"Each|\"&$G328,UOM_Conversions!$A$2:$E$50,4,FALSE))))","v":""},""]
[{"$nulls":9},{"$f":"IF($B329=\"\",\"\",IF($H329=\"Weight\",$F329*VLOOKUP(\"Weight|\"&$G329,UOM_Conversions!$A$2:$E$50,4,FALSE),IF($H329=\"Volume\",$F329*VLOOKUP(\"Volume|\"&$G329,UOM_Conversions!$A$2:$E$50,4,FALSE),$F329*VLOOKUP(\"Each|\"&$G329,UOM_Conversions!$A$2:$E$50,4,FALSE))))","v":""},""]
[{"$nulls":9},{"$f":"IF($B330=\"\",\"\",IF($H330=\"Weight\",$F330*VLOOKUP(\"Weight|\"&$G330,UOM_Conversions!$A$2:$E$50,4,FALSE),IF($H330=\"Volume\",$F330*VLOOKUP(\"Volume|\"&$G330,UOM_Conversions!$A$2:$E$50,4,FALSE),$F330*VLOOKUP(\"Each|\"&$G330,UOM_Conversions!$A$2:$E$50,4,FALSE))))","v":""},""]
[{"$nulls":9},{"$f":"IF($B331=\"\",\"\",IF($H331=\"Weight\",$F331*VLOOKUP(\"Weight|\"&$G331,UOM_Conversions!$A$2:$E$50,4,FALSE),IF($H331=\"Volume\",$F331*VLOOKUP(\"Volume|\"&$G331,UOM_Conversions!$A$2:$E$50,4,FALSE),$F331*VLOOKUP(\"Each|\"&$G331,UOM_Conversions!$A$2:$E$50,4,FALSE))))","v":""},""]
[{"$nulls":9},{"$f":"IF($B332=\"\",\"\",IF($H332=\"Weight\",$F332*VLOOKUP(\"Weight|\"&$G332,UOM_Conversions!$A$2:$E$50,4,FALSE),IF($H332=\"Volume\",$F332*VLOOKUP(\"Volume|\"&$G332,UOM_Conversions!$A$2:$E$50,4,FALSE),$F332*VLOOKUP(\"Each|\"&$G332,UOM_Conversions!$A$2:$E$50,4,FALSE))))","v":""},""]
[{"$nulls":9},{"$f":"IF($B333=\"\",\"\",IF($H333=\"Weight\",$F333*VLOOKUP(\"Weight|\"&$G333,UOM_Conversions!$A$2:$E$50,4,FALSE),IF($H333=\"Volume\",$F333*VLOOKUP(\"Volume|\"&$G333,UOM_Conversions!$A$2:$E$50,4,FALSE),$F333*VLOOKUP(\"Each|\"&$G333,UOM_Conversions!$A$2:$E$50,4,FALSE))))","v":""},""]
[{"$nulls":9},{"$f":"IF($B334=\"\",\"\",IF($H334=\"Weight\",$F334*VLOOKUP(\"Weight|\"&$G334,UOM_Conversions!$A$2:$E$50,4,FALSE),IF($H334=\"Volume\",$F334*VLOOKUP(\"Volume|\"&$G334,UOM_Conversions!$A$2:$E$50,4,FALSE),$F334*VLOOKUP(\"Each|\"&$G334,UOM_Conversions!$A$2:$E$50,4,FALSE))))","v":""},""]
[{"$nulls":9},{"$f":"IF($B335=\"\",\"\",IF($H335=\"Weight\",$F335*VLOOKUP(\"Weight|\"&$G335,UOM_Conversions!$A$2:$E$50,4,FALSE),IF($H335=\"Volume\",$F335*VLOOKUP(\"Volume|\"&$G335,UOM_Conversions!$A$2:$E$50,4,FALSE),$F335*VLOOKUP(\"Each|\"&$G335,UOM_Conversions!$A$2:$E$50,4,FALSE))))","v":""},""]
[{"$nulls":9},{"$f":"IF($B336=\"\",\"\",IF($H336=\"Weight\",$F336*VLOOKUP(\"Weight|\"&$G336,UOM_Conversions!$A$2:$E$50,4,FALSE),IF($H336=\"Volume\",$F336*VLOOKUP(\"Volume|\"&$G336,UOM_Conversions!$A$2:$E$50,4,FALSE),$F336*VLOOKUP(\"Each|\"&$G336,UOM_Conversions!$A$2:$E$50,4,FALSE))))","v":""},""]
[{"$nulls":9},{"$f":"IF($B337=\"\",\"\",IF($H337=\"Weight\",$F337*VLOOKUP(\"Weight|\"&$G337,UOM_Conversions!$A$2:$E$50,4,FALSE),IF($H337=\"Volume\",$F337*VLOOKUP(\"Volume|\"&$G337,UOM_Conversions!$A$2:$E$50,4,FALSE),$F337*VLOOKUP(\"Each|\"&$G337,UOM_Conversions!$A$2:$E$50,4,FALSE))))","v":""},""]
[{"$nulls":9},{"$f":"IF($B338=\"\",\"\",IF($H338=\"Weight\",$F338*VLOOKUP(\"Weight|\"&$G338,UOM_Conversions!$A$2:$E$50,4,FALSE),IF($H338=\"Volume\",$F338*VLOOKUP(\"Volume|\"&$G338,UOM_Conversions!$A$2:$E$50,4,FALSE),$F338*VLOOKUP(\"Each|\"&$G338,UOM_Conversions!$A$2:$E$50,4,FALSE))))","v":""},""]
[{"$nulls":9},{"$f":"IF($B339=\"\",\"\",IF($H339=\"Weight\",$F339*VLOOKUP(\"Weight|\"&$G339,UOM_Conversions!$A$2:$E$50,4,FALSE),IF($H339=\"Volume\",$F339*VLOOKUP(\"Volume|\"&$G339,UOM_Conversions!$A$2:$E$50,4,FALSE),$F339*VLOOKUP(\"Each|\"&$G339,UOM_Conversions!$A$2:$E$50,4,FALSE))))","v":""},""]
[{"$nulls":9},{"$f":"IF($B340=\"\",\"\",IF($H340=\"Weight\",$F340*VLOOKUP(\"Weight|\"&$G340,UOM_Conversions!$A$2:$E$50,4,FALSE),IF($H340=\"Volume\",$F340*VLOOKUP(\"Volume|\"&$G340,UOM_Conversions!$A$2:$E$50,4,FALSE),$F340*VLOOKUP(\"Each|\"&$G340,UOM_Conversions!$A$2:$E$50,4,FALSE))))","v":""},""]
[{"$nulls":9},{"$f":"IF($B341=\"\",\"\",IF($H341=\"Weight\",$F341*VLOOKUP(\"Weight|\"&$G341,UOM_Conversions!$A$2:$E$50,4,FALSE),IF($H341=\"Volume\",$F341*VLOOKUP(\"Volume|\"&$G341,UOM_Conversions!$A$2:$E$50,4,FALSE),$F341*VLOOKUP(\"Each|\"&$G341,UOM_Conversions!$A$2:$E$50,4,FALSE))))","v":""},""]
[{"$nulls":9},{"$f":"IF($B342=\"\",\"\",IF($H342=\"Weight\",$F342*VLOOKUP(\"Weight|\"&$G342,UOM_Conversions!$A$2:$E$50,4,FALSE),IF($H342=\"Volume\",$F342*VLOOKUP(\"Volume|\"&$G342,UOM_Conversions!$A$2:$E$50,4,FALSE),$F342*VLOOKUP(\"Each|\"&$G342,UOM_Conversions!$A$2:$E$50,4,FALSE))))","v":""},""]
[{"$nulls":9},{"$f":"IF($B343=\"\",\"\",IF($H343=\"Weight\",$F343*VLOOKUP(\"Weight|\"&$G343,UOM_Conversions!$A$2:$E$50,4,FALSE),IF($H343=\"Volume\",$F343*VLOOKUP(\"Volume|\"&$G343,UOM_Conversions!$A$2:$E$50,4,FALSE),$F343*VLOOKUP(\"Each|\"&$G343,UOM_Conversions!$A$2:$E$50,4,FALSE))))","v":""},""]
[{"$nulls":9},{"$f":"IF($B344=\"\",\"\",IF($H344=\"Weight\",$F344*VLOOKUP(\"Weight|\"&$G344,UOM_Conversions!$A$2:$E$50,4,FALSE),IF($H344=\"Volume\",$F344*VLOOKUP(\"Volume|\"&$G344,UOM_Conversions!$A$2:$E$50,4,FALSE),$F344*VLOOKUP(\"Each|\"&$G344,UOM_Conversions!$A$2:$E$50,4,FALSE))))","v":""},""]
[{"$nulls":9},{"$f":"IF($B345=\"\",\"\",IF($H345=\"Weight\",$F345*VLOOKUP(\"Weight|\"&$G345,UOM_Conversions!$A$2:$E$50,4,FALSE),IF($H345=\"Volume\",$F345*VLOOKUP(\"Volume|\"&$G345,UOM_Conversions!$A$2:$E$50,4,FALSE),$F345*VLOOKUP(\"Each|\"&$G345,UOM_Conversions!$A$2:$E$50,4,FALSE))))","v":""},""]
[{"$nulls":9},{"$f":"IF($B346=\"\",\"\",IF($H346=\"Weight\",$F346*VLOOKUP(\"Weight|\"&$G346,UOM_Conversions!$A$2:$E$50,4,FALSE),IF($H346=\"Volume\",$F346*VLOOKUP(\"Volume|\"&$G346,UOM_Conversions!$A$2:$E$50,4,FALSE),$F346*VLOOKUP(\"Each|\"&$G346,UOM_Conversions!$A$2:$E$50,4,FALSE))))","v":""},""]
[{"$nulls":9},{"$f":"IF($B347=\"\",\"\",IF($H347=\"Weight\",$F347*VLOOKUP(\"Weight|\"&$G347,UOM_Conversions!$A$2:$E$50,4,FALSE),IF($H347=\"Volume\",$F347*VLOOKUP(\"Volume|\"&$G347,UOM_Conversions!$A$2:$E$50,4,FALSE),$F347*VLOOKUP(\"Each|\"&$G347,UOM_Conversions!$A$2:$E$50,4,FALSE))))","v":""},""]
[{"$nulls":9},{"$f":"IF($B348=\"\",\"\",IF($H348=\"Weight\",$F348*VLOOKUP(\"Weight|\"&$G348,UOM_Conversions!$A$2:$E$50,4,FALSE),IF($H348=\"Volume\",$F348*VLOOKUP(\"Volume|\"&$G348,UOM_Conversions!$A$2:$E$50,4,FALSE),$F348*VLOOKUP(\"Each|\"&$G348,UOM_Conversions!$A$2:$E$50,4,FALSE))))","v":""},""]
[{"$nulls":9},{"$f":"IF($B349=\"\",\"\",IF($H349=\"Weight\",$F349*VLOOKUP(\"Weight|\"&$G349,UOM_Conversions!$A$2:$E$50,4,FALSE),IF($H349=\"Volume\",$F349*VLOOKUP(\"Volume|\"&$G349,UOM_Conversions!$A$2:$E$50,4,FALSE),$F349*VLOOKUP(\"Each|\"&$G349,UOM_Conversions!$A$2:$E$50,4,FALSE))))","v":""},""]
[{"$nulls":9},{"$f":"IF($B350=\"\",\"\",IF($H350=\"Weight\",$F350*VLOOKUP(\"Weight|\"&$G350,UOM_Conversions!$A$2:$E$50,4,FALSE),IF($H350=\"Volume\",$F350*VLOOKUP(\"Volume|\"&$G350,UOM_Conversions!$A$2:$E$50,4,FALSE),$F350*VLOOKUP(\"Each|\"&$G350,UOM_Conversions!$A$2:$E$50,4,FALSE))))","v":""},""]
[{"$nulls":9},{"$f":"IF($B351=\"\",\"\",IF($H351=\"Weight\",$F351*VLOOKUP(\"Weight|\"&$G351,UOM_Conversions!$A$2:$E$50,4,FALSE),IF($H351=\"Volume\",$F351*VLOOKUP(\"Volume|\"&$G351,UOM_Conversions!$A$2:$E$50,4,FALSE),$F351*VLOOKUP(\"Each|\"&$G351,UOM_Conversions!$A$2:$E$50,4,FALSE))))","v":""},""]
[{"$nulls":9},{"$f":"IF($B352=\"\",\"\",IF($H352=\"Weight\",$F352*VLOOKUP(\"Weight|\"&$G352,UOM_Conversions!$A$2:$E$50,4,FALSE),IF($H352=\"Volume\",$F352*VLOOKUP(\"Volume|\"&$G352,UOM_Conversions!$A$2:$E$50,4,FALSE),$F352*VLOOKUP(\"Each|\"&$G352,UOM_Conversions!$A$2:$E$50,4,FALSE))))","v":""},""]
[{"$nulls":9},{"$f":"IF($B353=\"\",\"\",IF($H353=\"Weight\",$F353*VLOOKUP(\"Weight|\"&$G353,UOM_Conversions!$A$2:$E$50,4,FALSE),IF($H353=\"Volume\",$F353*VLOOKUP(\"Volume|\"&$G353,UOM_Conversions!$A$2:$E$50,4,FALSE),$F353*VLOOKUP(\"Each|\"&$G353,UOM_Conversions!$A$2:$E$50,4,FALSE))))","v":""},""]
[{"$nulls":9},{"$f":"IF($B354=\"\",\"\",IF($H354=\"Weight\",$F354*VLOOKUP(\"Weight|\"&$G354,UOM_Conversions!$A$2:$E$50,4,FALSE),IF($H354=\"Volume\",$F354*VLOOKUP(\"Volume|\"&$G354,UOM_Conversions!$A$2:$E$50,4,FALSE),$F354*VLOOKUP(\"Each|\"&$G354,UOM_Conversions!$A$2:$E$50,4,FALSE))))","v":""},""]
[{"$nulls":9},{"$f":"IF($B355=\"\",\"\",IF($H355=\"Weight\",$F355*VLOOKUP(\"Weight|\"&$G355,UOM_Conversions!$A$2:$E$50,4,FALSE),IF($H355=\"Volume\",$F355*VLOOKUP(\"Volume|\"&$G355,UOM_Conversions!$A$2:$E$50,4,FALSE),$F355*VLOOKUP(\"Each|\"&$G355,UOM_Conversions!$A$2:$E$50,4,FALSE))))","v":""},""]
[{"$nulls":9},{"$f":"IF($B356=\"\",\"\",IF($H356=\"Weight\",$F356*VLOOKUP(\"Weight|\"&$G356,UOM_Conversions!$A$2:$E$50,4,FALSE),IF($H356=\"Volume\",$F356*VLOOKUP(\"Volume|\"&$G356,UOM_Conversions!$A$2:$E$50,4,FALSE),$F356*VLOOKUP(\"Each|\"&$G356,UOM_Conversions!$A$2:$E$50,4,FALSE))))","v":""},""]
[{"$nulls":9},{"$f":"IF($B357=\"\",\"\",IF($H357=\"Weight\",$F357*VLOOKUP(\"Weight|\"&$G357,UOM_Conversions!$A$2:$E$50,4,FALSE),IF($H357=\"Volume\",$F357*VLOOKUP(\"Volume|\"&$G357,UOM_Conversions!$A$2:$E$50,4,FALSE),$F357*VLOOKUP(\"Each|\"&$G357,UOM_Conversions!$A$2:$E$50,4,FALSE))))","v":""},""]
[{"$nulls":9},{"$f":"IF($B358=\"\",\"\",IF($H358=\"Weight\",$F358*VLOOKUP(\"Weight|\"&$G358,UOM_Conversions!$A$2:$E$50,4,FALSE),IF($H358=\"Volume\",$F358*VLOOKUP(\"Volume|\"&$G358,UOM_Conversions!$A$2:$E$50,4,FALSE),$F358*VLOOKUP(\"Each|\"&$G358,UOM_Conversions!$A$2:$E$50,4,FALSE))))","v":""},""]
[{"$nulls":9},{"$f":"IF($B359=\"\",\"\",IF($H359=\"Weight\",$F359*VLOOKUP(\"Weight|\"&$G359,UOM_Conversions!$A$2:$E$50,4,FALSE),IF($H359=\"Volume\",$F359*VLOOKUP(\"Volume|\"&$G359,UOM_Conversions!$A$2:$E$50,4,FALSE),$F359*VLOOKUP(\"Each|\"&$G359,UOM_Conversions!$A$2:$E$50,4,FALSE))))","v":""},""]
[{"$nulls":9},{"$f":"IF($B360=\"\",\"\",IF($H360=\"Weight\",$F360*VLOOKUP(\"Weight|\"&$G360,UOM_Conversions!$A$2:$E$50,4,FALSE),IF($H360=\"Volume\",$F360*VLOOKUP(\"Volume|\"&$G360,UOM_Conversions!$A$2:$E$50,4,FALSE),$F360*VLOOKUP(\"Each|\"&$G360,UOM_Conversions!$A$2:$E$50,4,FALSE))))","v":""},""]
[{"$nulls":9},{"$f":"IF($B361=\"\",\"\",IF($H361=\"Weight\",$F361*VLOOKUP(\"Weight|\"&$G361,UOM_Conversions!$A$2:$E$50,4,FALSE),IF($H361=\"Volume\",$F361*VLOOKUP(\"Volume|\"&$G361,UOM_Conversions!$A$2:$E$50,4,FALSE),$F361*VLOOKUP(\"Each|\"&$G361,UOM_Conversions!$A$2:$E$50,4,FALSE))))","v":""},""]
[{"$nulls":9},{"$f":"IF($B362=\"\",\"\",IF($H362=\"Weight\",$F362*VLOOKUP(\"Weight|\"&$G362,UOM_Conversions!$A$2:$E$50,4,FALSE),IF($H362=\"Volume\",$F362*VLOOKUP(\"Volume|\"&$G362,UOM_Conversions!$A$2:$E$50,4,FALSE),$F362*VLOOKUP(\"Each|\"&$G362,UOM_Conversions!$A$2:$E$50,4,FALSE))))","v":""},""]
[{"$nulls":9},{"$f":"IF($B363=\"\",\"\",IF($H363=\"Weight\",$F363*VLOOKUP(\"Weight|\"&$G363,UOM_Conversions!$A$2:$E$50,4,FALSE),IF($H363=\"Volume\",$F363*VLOOKUP(\"Volume|\"&$G363,UOM_Conversions!$A$2:$E$50,4,FALSE),$F363*VLOOKUP(\"Each|\"&$G363,UOM_Conversions!$A$2:$E$50,4,FALSE))))","v":""},""]
[{"$nulls":9},{"$f":"IF($B364=\"\",\"\",IF($H364=\"Weight\",$F364*VLOOKUP(\"Weight|\"&$G364,UOM_Conversions!$A$2:$E$50,4,FALSE),IF($H364=\"Volume\",$F364*VLOOKUP(\"Volume|\"&$G364,UOM_Conversions!$A$2:$E$50,4,FALSE),$F364*VLOOKUP(\"Each|\"&$G364,UOM_Conversions!$A$2:$E$50,4,FALSE))))","v":""},""]
[{"$nulls":9},{"$f":"IF($B365=\"\",\"\",IF($H365=\"Weight\",$F365*VLOOKUP(\"Weight|\"&$G365,UOM_Conversions!$A$2:$E$50,4,FALSE),IF($H365=\"Volume\",$F365*VLOOKUP(\"Volume|\"&$G365,UOM_Conversions!$A$2:$E$50,4,FALSE),$F365*VLOOKUP(\"Each|\"&$G365,UOM_Conversions!$A$2:$E$50,4,FALSE))))","v":""},""]
[{"$nulls":9},{"$f":"IF($B366=\"\",\"\",IF($H366=\"Weight\",$F366*VLOOKUP(\"Weight|\"&$G366,UOM_Conversions!$A$2:$E$50,4,FALSE),IF($H366=\"Volume\",$F366*VLOOKUP(\"Volume|\"&$G366,UOM_Conversions!$A$2:$E$50,4,FALSE),$F366*VLOOKUP(\"Each|\"&$G366,UOM_Conversions!$A$2:$E$50,4,FALSE))))","v":""},""]
[{"$nulls":9},{"$f":"IF($B367=\"\",\"\",IF($H367=\"Weight\",$F367*VLOOKUP(\"Weight|\"&$G367,UOM_Conversions!$A$2:$E$50,4,FALSE),IF($H367=\"Volume\",$F367*VLOOKUP(\"Volume|\"&$G367,UOM_Conversions!$A$2:$E$50,4,FALSE),$F367*VLOOKUP(\"Each|\"&$G367,UOM_Conversions!$A$2:$E$50,4,FALSE))))","v":""},""]
[{"$nulls":9},{"$f":"IF($B368=\"\",\"\",IF($H368=\"Weight\",$F368*VLOOKUP(\"Weight|\"&$G368,UOM_Conversions!$A$2:$E$50,4,FALSE),IF($H368=\"Volume\",$F368*VLOOKUP(\"Volume|\"&$G368,UOM_Conversions!$A$2:$E$50,4,FALSE),$F368*VLOOKUP(\"Each|\"&$G368,UOM_Conversions!$A$2:$E$50,4,FALSE))))","v":""},""]
[{"$nulls":9},{"$f":"IF($B369=\"\",\"\",IF($H369=\"Weight\",$F369*VLOOKUP(\"Weight|\"&$G369,UOM_Conversions!$A$2:$E$50,4,FALSE),IF($H369=\"Volume\",$F369*VLOOKUP(\"Volume|\"&$G369,UOM_Conversions!$A$2:$E$50,4,FALSE),$F369*VLOOKUP(\"Each|\"&$G369,UOM_Conversions!$A$2:$E$50,4,FALSE))))","v":""},""]
[{"$nulls":9},{"$f":"IF($B370=\"\",\"\",IF($H370=\"Weight\",$F370*VLOOKUP(\"Weight|\"&$G370,UOM_Conversions!$A$2:$E$50,4,FALSE),IF($H370=\"Volume\",$F370*VLOOKUP(\"Volume|\"&$G370,UOM_Conversions!$A$2:$E$50,4,FALSE),$F370*VLOOKUP(\"Each|\"&$G370,UOM_Conversions!$A$2:$E$50,4,FALSE))))","v":""},""]
[{"$nulls":9},{"$f":"IF($B371=\"\",\"\",IF($H371=\"Weight\",$F371*VLOOKUP(\"Weight|\"&$G371,UOM_Conversions!$A$2:$E$50,4,FALSE),IF($H371=\"Volume\",$F371*VLOOKUP(\"Volume|\"&$G371,UOM_Conversions!$A$2:$E$50,4,FALSE),$F371*VLOOKUP(\"Each|\"&$G371,UOM_Conversions!$A$2:$E$50,4,FALSE))))","v":""},""]
[{"$nulls":9},{"$f":"IF($B372=\"\",\"\",IF($H372=\"Weight\",$F372*VLOOKUP(\"Weight|\"&$G372,UOM_Conversions!$A$2:$E$50,4,FALSE),IF($H372=\"Volume\",$F372*VLOOKUP(\"Volume|\"&$G372,UOM_Conversions!$A$2:$E$50,4,FALSE),$F372*VLOOKUP(\"Each|\"&$G372,UOM_Conversions!$A$2:$E$50,4,FALSE))))","v":""},""]
[{"$nulls":9},{"$f":"IF($B373=\"\",\"\",IF($H373=\"Weight\",$F373*VLOOKUP(\"Weight|\"&$G373,UOM_Conversions!$A$2:$E$50,4,FALSE),IF($H373=\"Volume\",$F373*VLOOKUP(\"Volume|\"&$G373,UOM_Conversions!$A$2:$E$50,4,FALSE),$F373*VLOOKUP(\"Each|\"&$G373,UOM_Conversions!$A$2:$E$50,4,FALSE))))","v":""},""]
[{"$nulls":9},{"$f":"IF($B374=\"\",\"\",IF($H374=\"Weight\",$F374*VLOOKUP(\"Weight|\"&$G374,UOM_Conversions!$A$2:$E$50,4,FALSE),IF($H374=\"Volume\",$F374*VLOOKUP(\"Volume|\"&$G374,UOM_Conversions!$A$2:$E$50,4,FALSE),$F374*VLOOKUP(\"Each|\"&$G374,UOM_Conversions!$A$2:$E$50,4,FALSE))))","v":""},""]
[{"$nulls":9},{"$f":"IF($B375=\"\",\"\",IF($H375=\"Weight\",$F375*VLOOKUP(\"Weight|\"&$G375,UOM_Conversions!$A$2:$E$50,4,FALSE),IF($H375=\"Volume\",$F375*VLOOKUP(\"Volume|\"&$G375,UOM_Conversions!$A$2:$E$50,4,FALSE),$F375*VLOOKUP(\"Each|\"&$G375,UOM_Conversions!$A$2:$E$50,4,FALSE))))","v":""},""]
[{"$nulls":9},{"$f":"IF($B376=\"\",\"\",IF($H376=\"Weight\",$F376*VLOOKUP(\"Weight|\"&$G376,UOM_Conversions!$A$2:$E$50,4,FALSE),IF($H376=\"Volume\",$F376*VLOOKUP(\"Volume|\"&$G376,UOM_Conversions!$A$2:$E$50,4,FALSE),$F376*VLOOKUP(\"Each|\"&$G376,UOM_Conversions!$A$2:$E$50,4,FALSE))))","v":""},""]
[{"$nulls":9},{"$f":"IF($B377=\"\",\"\",IF($H377=\"Weight\",$F377*VLOOKUP(\"Weight|\"&$G377,UOM_Conversions!$A$2:$E$50,4,FALSE),IF($H377=\"Volume\",$F377*VLOOKUP(\"Volume|\"&$G377,UOM_Conversions!$A$2:$E$50,4,FALSE),$F377*VLOOKUP(\"Each|\"&$G377,UOM_Conversions!$A$2:$E$50,4,FALSE))))","v":""},""]
[{"$nulls":9},{"$f":"IF($B378=\"\",\"\",IF($H378=\"Weight\",$F378*VLOOKUP(\"Weight|\"&$G378,UOM_Conversions!$A$2:$E$50,4,FALSE),IF($H378=\"Volume\",$F378*VLOOKUP(\"Volume|\"&$G378,UOM_Conversions!$A$2:$E$50,4,FALSE),$F378*VLOOKUP(\"Each|\"&$G378,UOM_Conversions!$A$2:$E$50,4,FALSE))))","v":""},""]
[{"$nulls":9},{"$f":"IF($B379=\"\",\"\",IF($H379=\"Weight\",$F379*VLOOKUP(\"Weight|\"&$G379,UOM_Conversions!$A$2:$E$50,4,FALSE),IF($H379=\"Volume\",$F379*VLOOKUP(\"Volume|\"&$G379,UOM_Conversions!$A$2:$E$50,4,FALSE),$F379*VLOOKUP(\"Each|\"&$G379,UOM_Conversions!$A$2:$E$50,4,FALSE))))","v":""},""]
[{"$nulls":9},{"$f":"IF($B380=\"\",\"\",IF($H380=\"Weight\",$F380*VLOOKUP(\"Weight|\"&$G380,UOM_Conversions!$A$2:$E$50,4,FALSE),IF($H380=\"Volume\",$F380*VLOOKUP(\"Volume|\"&$G380,UOM_Conversions!$A$2:$E$50,4,FALSE),$F380*VLOOKUP(\"Each|\"&$G380,UOM_Conversions!$A$2:$E$50,4,FALSE))))","v":""},""]
[{"$nulls":9},{"$f":"IF($B381=\"\",\"\",IF($H381=\"Weight\",$F381*VLOOKUP(\"Weight|\"&$G381,UOM_Conversions!$A$2:$E$50,4,FALSE),IF($H381=\"Volume\",$F381*VLOOKUP(\"Volume|\"&$G381,UOM_Conversions!$A$2:$E$50,4,FALSE),$F381*VLOOKUP(\"Each|\"&$G381,UOM_Conversions!$A$2:$E$50,4,FALSE))))","v":""},""]
[{"$nulls":9},{"$f":"IF($B382=\"\",\"\",IF($H382=\"Weight\",$F382*VLOOKUP(\"Weight|\"&$G382,UOM_Conversions!$A$2:$E$50,4,FALSE),IF($H382=\"Volume\",$F382*VLOOKUP(\"Volume|\"&$G382,UOM_Conversions!$A$2:$E$50,4,FALSE),$F382*VLOOKUP(\"Each|\"&$G382,UOM_Conversions!$A$2:$E$50,4,FALSE))))","v":""},""]
[{"$nulls":9},{"$f":"IF($B383=\"\",\"\",IF($H383=\"Weight\",$F383*VLOOKUP(\"Weight|\"&$G383,UOM_Conversions!$A$2:$E$50,4,FALSE),IF($H383=\"Volume\",$F383*VLOOKUP(\"Volume|\"&$G383,UOM_Conversions!$A$2:$E$50,4,FALSE),$F383*VLOOKUP(\"Each|\"&$G383,UOM_Conversions!$A$2:$E$50,4,FALSE))))","v":""},""]
[{"$nulls":9},{"$f":"IF($B384=\"\",\"\",IF($H384=\"Weight\",$F384*VLOOKUP(\"Weight|\"&$G384,UOM_Conversions!$A$2:$E$50,4,FALSE),IF($H384=\"Volume\",$F384*VLOOKUP(\"Volume|\"&$G384,UOM_Conversions!$A$2:$E$50,4,FALSE),$F384*VLOOKUP(\"Each|\"&$G384,UOM_Conversions!$A$2:$E$50,4,FALSE))))","v":""},""]
[{"$nulls":9},{"$f":"IF($B385=\"\",\"\",IF($H385=\"Weight\",$F385*VLOOKUP(\"Weight|\"&$G385,UOM_Conversions!$A$2:$E$50,4,FALSE),IF($H385=\"Volume\",$F385*VLOOKUP(\"Volume|\"&$G385,UOM_Conversions!$A$2:$E$50,4,FALSE),$F385*VLOOKUP(\"Each|\"&$G385,UOM_Conversions!$A$2:$E$50,4,FALSE))))","v":""},""]
[{"$nulls":9},{"$f":"IF($B386=\"\",\"\",IF($H386=\"Weight\",$F386*VLOOKUP(\"Weight|\"&$G386,UOM_Conversions!$A$2:$E$50,4,FALSE),IF($H386=\"Volume\",$F386*VLOOKUP(\"Volume|\"&$G386,UOM_Conversions!$A$2:$E$50,4,FALSE),$F386*VLOOKUP(\"Each|\"&$G386,UOM_Conversions!$A$2:$E$50,4,FALSE))))","v":""},{"$f":"IF($B386=\"\",\"\",IFERROR($E386/$J386,0))","v":""}]
[{"$nulls":9},{"$f":"IF($B387=\"\",\"\",IF($H387=\"Weight\",$F387*VLOOKUP(\"Weight|\"&$G387,UOM_Conversions!$A$2:$E$50,4,FALSE),IF($H387=\"Volume\",$F387*VLOOKUP(\"Volume|\"&$G387,UOM_Conversions!$A$2:$E$50,4,FALSE),$F387*VLOOKUP(\"Each|\"&$G387,UOM_Conversions!$A$2:$E$50,4,FALSE))))","v":""},""]
[{"$nulls":9},{"$f":"IF($B388=\"\",\"\",IF($H388=\"Weight\",$F388*VLOOKUP(\"Weight|\"&$G388,UOM_Conversions!$A$2:$E$50,4,FALSE),IF($H388=\"Volume\",$F388*VLOOKUP(\"Volume|\"&$G388,UOM_Conversions!$A$2:$E$50,4,FALSE),$F388*VLOOKUP(\"Each|\"&$G388,UOM_Conversions!$A$2:$E$50,4,FALSE))))","v":""},""]
[{"$nulls":9},{"$f":"IF($B389=\"\",\"\",IF($H389=\"Weight\",$F389*VLOOKUP(\"Weight|\"&$G389,UOM_Conversions!$A$2:$E$50,4,FALSE),IF($H389=\"Volume\",$F389*VLOOKUP(\"Volume|\"&$G389,UOM_Conversions!$A$2:$E$50,4,FALSE),$F389*VLOOKUP(\"Each|\"&$G389,UOM_Conversions!$A$2:$E$50,4,FALSE))))","v":""},""]
[{"$nulls":9},{"$f":"IF($B390=\"\",\"\",IF($H390=\"Weight\",$F390*VLOOKUP(\"Weight|\"&$G390,UOM_Conversions!$A$2:$E$50,4,FALSE),IF($H390=\"Volume\",$F390*VLOOKUP(\"Volume|\"&$G390,UOM_Conversions!$A$2:$E$50,4,FALSE),$F390*VLOOKUP(\"Each|\"&$G390,UOM_Conversions!$A$2:$E$50,4,FALSE))))","v":""},""]
[{"$nulls":9},{"$f":"IF($B391=\"\",\"\",IF($H391=\"Weight\",$F391*VLOOKUP(\"Weight|\"&$G391,UOM_Conversions!$A$2:$E$50,4,FALSE),IF($H391=\"Volume\",$F391*VLOOKUP(\"Volume|\"&$G391,UOM_Conversions!$A$2:$E$50,4,FALSE),$F391*VLOOKUP(\"Each|\"&$G391,UOM_Conversions!$A$2:$E$50,4,FALSE))))","v":""},""]
[{"$nulls":9},{"$f":"IF($B392=\"\",\"\",IF($H392=\"Weight\",$F392*VLOOKUP(\"Weight|\"&$G392,UOM_Conversions!$A$2:$E$50,4,FALSE),IF($H392=\"Volume\",$F392*VLOOKUP(\"Volume|\"&$G392,UOM_Conversions!$A$2:$E$50,4,FALSE),$F392*VLOOKUP(\"Each|\"&$G392,UOM_Conversions!$A$2:$E$50,4,FALSE))))","v":""},""]
[{"$nulls":9},{"$f":"IF($B393=\"\",\"\",IF($H393=\"Weight\",$F393*VLOOKUP(\"Weight|\"&$G393,UOM_Conversions!$A$2:$E$50,4,FALSE),IF($H393=\"Volume\",$F393*VLOOKUP(\"Volume|\"&$G393,UOM_Conversions!$A$2:$E$50,4,FALSE),$F393*VLOOKUP(\"Each|\"&$G393,UOM_Conversions!$A$2:$E$50,4,FALSE))))","v":""},""]
[{"$nulls":9},{"$f":"IF($B394=\"\",\"\",IF($H394=\"Weight\",$F394*VLOOKUP(\"Weight|\"&$G394,UOM_Conversions!$A$2:$E$50,4,FALSE),IF($H394=\"Volume\",$F394*VLOOKUP(\"Volume|\"&$G394,UOM_Conversions!$A$2:$E$50,4,FALSE),$F394*VLOOKUP(\"Each|\"&$G394,UOM_Conversions!$A$2:$E$50,4,FALSE))))","v":""},""]
[{"$nulls":9},{"$f":"IF($B395=\"\",\"\",IF($H395=\"Weight\",$F395*VLOOKUP(\"Weight|\"&$G395,UOM_Conversions!$A$2:$E$50,4,FALSE),IF($H395=\"Volume\",$F395*VLOOKUP(\"Volume|\"&$G395,UOM_Conversions!$A$2:$E$50,4,FALSE),$F395*VLOOKUP(\"Each|\"&$G395,UOM_Conversions!$A$2:$E$50,4,FALSE))))","v":""},""]
[{"$nulls":9},{"$f":"IF($B396=\"\",\"\",IF($H396=\"Weight\",$F396*VLOOKUP(\"Weight|\"&$G396,UOM_Conversions!$A$2:$E$50,4,FALSE),IF($H396=\"Volume\",$F396*VLOOKUP(\"Volume|\"&$G396,UOM_Conversions!$A$2:$E$50,4,FALSE),$F396*VLOOKUP(\"Each|\"&$G396,UOM_Conversions!$A$2:$E$50,4,FALSE))))","v":""},""]
[{"$nulls":9},{"$f":"IF($B397=\"\",\"\",IF($H397=\"Weight\",$F397*VLOOKUP(\"Weight|\"&$G397,UOM_Conversions!$A$2:$E$50,4,FALSE),IF($H397=\"Volume\",$F397*VLOOKUP(\"Volume|\"&$G397,UOM_Conversions!$A$2:$E$50,4,FALSE),$F397*VLOOKUP(\"Each|\"&$G397,UOM_Conversions!$A$2:$E$50,4,FALSE))))","v":""},""]
[{"$nulls":9},{"$f":"IF($B398=\"\",\"\",IF($H398=\"Weight\",$F398*VLOOKUP(\"Weight|\"&$G398,UOM_Conversions!$A$2:$E$50,4,FALSE),IF($H398=\"Volume\",$F398*VLOOKUP(\"Volume|\"&$G398,UOM_Conversions!$A$2:$E$50,4,FALSE),$F398*VLOOKUP(\"Each|\"&$G398,UOM_Conversions!$A$2:$E$50,4,FALSE))))","v":""},""]
[{"$nulls":9},{"$f":"IF($B399=\"\",\"\",IF($H399=\"Weight\",$F399*VLOOKUP(\"Weight|\"&$G399,UOM_Conversions!$A$2:$E$50,4,FALSE),IF($H399=\"Volume\",$F399*VLOOKUP(\"Volume|\"&$G399,UOM_Conversions!$A$2:$E$50,4,FALSE),$F399*VLOOKUP(\"Each|\"&$G399,UOM_Conversions!$A$2:$E$50,4,FALSE))))","v":""},""]
[{"$nulls":9},{"$f":"IF($B400=\"\",\"\",IF($H400=\"Weight\",$F400*VLOOKUP(\"Weight|\"&$G400,UOM_Conversions!$A$2:$E$50,4,FALSE),IF($H400=\"Volume\",$F400*VLOOKUP(\"Volume|\"&$G400,UOM_Conversions!$A$2:$E$50,4,FALSE),$F400*VLOOKUP(\"Each|\"&$G400,UOM_Conversions!$A$2:$E$50,4,FALSE))))","v":""},""]
[{"$nulls":9},{"$f":"IF($B401=\"\",\"\",IF($H401=\"Weight\",$F401*VLOOKUP(\"Weight|\"&$G401,UOM_Conversions!$A$2:$E$50,4,FALSE),IF($H401=\"Volume\",$F401*VLOOKUP(\"Volume|\"&$G401,UOM_Conversions!$A$2:$E$50,4,FALSE),$F401*VLOOKUP(\"Each|\"&$G401,UOM_Conversions!$A$2:$E$50,4,FALSE))))","v":""},""]
[{"$nulls":9},{"$f":"IF($B402=\"\",\"\",IF($H402=\"Weight\",$F402*VLOOKUP(\"Weight|\"&$G402,UOM_Conversions!$A$2:$E$50,4,FALSE),IF($H402=\"Volume\",$F402*VLOOKUP(\"Volume|\"&$G402,UOM_Conversions!$A$2:$E$50,4,FALSE),$F402*VLOOKUP(\"Each|\"&$G402,UOM_Conversions!$A$2:$E$50,4,FALSE))))","v":""},""]
[{"$nulls":9},{"$f":"IF($B403=\"\",\"\",IF($H403=\"Weight\",$F403*VLOOKUP(\"Weight|\"&$G403,UOM_Conversions!$A$2:$E$50,4,FALSE),IF($H403=\"Volume\",$F403*VLOOKUP(\"Volume|\"&$G403,UOM_Conversions!$A$2:$E$50,4,FALSE),$F403*VLOOKUP(\"Each|\"&$G403,UOM_Conversions!$A$2:$E$50,4,FALSE))))","v":""},""]
[{"$nulls":9},{"$f":"IF($B404=\"\",\"\",IF($H404=\"Weight\",$F404*VLOOKUP(\"Weight|\"&$G404,UOM_Conversions!$A$2:$E$50,4,FALSE),IF($H404=\"Volume\",$F404*VLOOKUP(\"Volume|\"&$G404,UOM_Conversions!$A$2:$E$50,4,FALSE),$F404*VLOOKUP(\"Each|\"&$G404,UOM_Conversions!$A$2:$E$50,4,FALSE))))","v":""},""]
[{"$nulls":9},{"$f":"IF($B405=\"\",\"\",IF($H405=\"Weight\",$F405*VLOOKUP(\"Weight|\"&$G405,UOM_Conversions!$A$2:$E$50,4,FALSE),IF($H405=\"Volume\",$F405*VLOOKUP(\"Volume|\"&$G405,UOM_Conversions!$A$2:$E$50,4,FALSE),$F405*VLOOKUP(\"Each|\"&$G405,UOM_Conversions!$A$2:$E$50,4,FALSE))))","v":""},""]
[{"$nulls":9},{"$f":"IF($B406=\"\",\"\",IF($H406=\"Weight\",$F406*VLOOKUP(\"Weight|\"&$G406,UOM_Conversions!$A$2:$E$50,4,FALSE),IF($H406=\"Volume\",$F406*VLOOKUP(\"Volume|\"&$G406,UOM_Conversions!$A$2:$E$50,4,FALSE),$F406*VLOOKUP(\"Each|\"&$G406,UOM_Conversions!$A$2:$E$50,4,FALSE))))","v":""},""]
[{"$nulls":9},{"$f":"IF($B407=\"\",\"\",IF($H407=\"Weight\",$F407*VLOOKUP(\"Weight|\"&$G407,UOM_Conversions!$A$2:$E$50,4,FALSE),IF($H407=\"Volume\",$F407*VLOOKUP(\"Volume|\"&$G407,UOM_Conversions!$A$2:$E$50,4,FALSE),$F407*VLOOKUP(\"Each|\"&$G407,UOM_Conversions!$A$2:$E$50,4,FALSE))))","v":""},""]
[{"$nulls":9},{"$f":"IF($B408=\"\",\"\",IF($H408=\"Weight\",$F408*VLOOKUP(\"Weight|\"&$G408,UOM_Conversions!$A$2:$E$50,4,FALSE),IF($H408=\"Volume\",$F408*VLOOKUP(\"Volume|\"&$G408,UOM_Conversions!$A$2:$E$50,4,FALSE),$F408*VLOOKUP(\"Each|\"&$G408,UOM_Conversions!$A$2:$E$50,4,FALSE))))","v":""},""]
[{"$nulls":9},{"$f":"IF($B409=\"\",\"\",IF($H409=\"Weight\",$F409*VLOOKUP(\"Weight|\"&$G409,UOM_Conversions!$A$2:$E$50,4,FALSE),IF($H409=\"Volume\",$F409*VLOOKUP(\"Volume|\"&$G409,UOM_Conversions!$A$2:$E$50,4,FALSE),$F409*VLOOKUP(\"Each|\"&$G409,UOM_Conversions!$A$2:$E$50,4,FALSE))))","v":""},""]
[{"$nulls":9},{"$f":"IF($B410=\"\",\"\",IF($H410=\"Weight\",$F410*VLOOKUP(\"Weight|\"&$G410,UOM_Conversions!$A$2:$E$50,4,FALSE),IF($H410=\"Volume\",$F410*VLOOKUP(\"Volume|\"&$G410,UOM_Conversions!$A$2:$E$50,4,FALSE),$F410*VLOOKUP(\"Each|\"&$G410,UOM_Conversions!$A$2:$E$50,4,FALSE))))","v":""},""]
[{"$nulls":9},{"$f":"IF($B411=\"\",\"\",IF($H411=\"Weight\",$F411*VLOOKUP(\"Weight|\"&$G411,UOM_Conversions!$A$2:$E$50,4,FALSE),IF($H411=\"Volume\",$F411*VLOOKUP(\"Volume|\"&$G411,UOM_Conversions!$A$2:$E$50,4,FALSE),$F411*VLOOKUP(\"Each|\"&$G411,UOM_Conversions!$A$2:$E$50,4,FALSE))))","v":""},""]
[{"$nulls":9},{"$f":"IF($B412=\"\",\"\",IF($H412=\"Weight\",$F412*VLOOKUP(\"Weight|\"&$G412,UOM_Conversions!$A$2:$E$50,4,FALSE),IF($H412=\"Volume\",$F412*VLOOKUP(\"Volume|\"&$G412,UOM_Conversions!$A$2:$E$50,4,FALSE),$F412*VLOOKUP(\"Each|\"&$G412,UOM_Conversions!$A$2:$E$50,4,FALSE))))","v":""},""]
[{"$nulls":9},{"$f":"IF($B413=\"\",\"\",IF($H413=\"Weight\",$F413*VLOOKUP(\"Weight|\"&$G413,UOM_Conversions!$A$2:$E$50,4,FALSE),IF($H413=\"Volume\",$F413*VLOOKUP(\"Volume|\"&$G413,UOM_Conversions!$A$2:$E$50,4,FALSE),$F413*VLOOKUP(\"Each|\"&$G413,UOM_Conversions!$A$2:$E$50,4,FALSE))))","v":""},""]
[{"$nulls":9},{"$f":"IF($B414=\"\",\"\",IF($H414=\"Weight\",$F414*VLOOKUP(\"Weight|\"&$G414,UOM_Conversions!$A$2:$E$50,4,FALSE),IF($H414=\"Volume\",$F414*VLOOKUP(\"Volume|\"&$G414,UOM_Conversions!$A$2:$E$50,4,FALSE),$F414*VLOOKUP(\"Each|\"&$G414,UOM_Conversions!$A$2:$E$50,4,FALSE))))","v":""},""]
[{"$nulls":9},{"$f":"IF($B415=\"\",\"\",IF($H415=\"Weight\",$F415*VLOOKUP(\"Weight|\"&$G415,UOM_Conversions!$A$2:$E$50,4,FALSE),IF($H415=\"Volume\",$F415*VLOOKUP(\"Volume|\"&$G415,UOM_Conversions!$A$2:$E$50,4,FALSE),$F415*VLOOKUP(\"Each|\"&$G415,UOM_Conversions!$A$2:$E$50,4,FALSE))))","v":""},""]
[{"$nulls":9},{"$f":"IF($B416=\"\",\"\",IF($H416=\"Weight\",$F416*VLOOKUP(\"Weight|\"&$G416,UOM_Conversions!$A$2:$E$50,4,FALSE),IF($H416=\"Volume\",$F416*VLOOKUP(\"Volume|\"&$G416,UOM_Conversions!$A$2:$E$50,4,FALSE),$F416*VLOOKUP(\"Each|\"&$G416,UOM_Conversions!$A$2:$E$50,4,FALSE))))","v":""},""]
[{"$nulls":9},{"$f":"IF($B417=\"\",\"\",IF($H417=\"Weight\",$F417*VLOOKUP(\"Weight|\"&$G417,UOM_Conversions!$A$2:$E$50,4,FALSE),IF($H417=\"Volume\",$F417*VLOOKUP(\"Volume|\"&$G417,UOM_Conversions!$A$2:$E$50,4,FALSE),$F417*VLOOKUP(\"Each|\"&$G417,UOM_Conversions!$A$2:$E$50,4,FALSE))))","v":""},""]
[{"$nulls":9},{"$f":"IF($B418=\"\",\"\",IF($H418=\"Weight\",$F418*VLOOKUP(\"Weight|\"&$G418,UOM_Conversions!$A$2:$E$50,4,FALSE),IF($H418=\"Volume\",$F418*VLOOKUP(\"Volume|\"&$G418,UOM_Conversions!$A$2:$E$50,4,FALSE),$F418*VLOOKUP(\"Each|\"&$G418,UOM_Conversions!$A$2:$E$50,4,FALSE))))","v":""},""]
[{"$nulls":9},{"$f":"IF($B419=\"\",\"\",IF($H419=\"Weight\",$F419*VLOOKUP(\"Weight|\"&$G419,UOM_Conversions!$A$2:$E$50,4,FALSE),IF($H419=\"Volume\",$F419*VLOOKUP(\"Volume|\"&$G419,UOM_Conversions!$A$2:$E$50,4,FALSE),$F419*VLOOKUP(\"Each|\"&$G419,UOM_Conversions!$A$2:$E$50,4,FALSE))))","v":""},""]
[{"$nulls":9},{"$f":"IF($B420=\"\",\"\",IF($H420=\"Weight\",$F420*VLOOKUP(\"Weight|\"&$G420,UOM_Conversions!$A$2:$E$50,4,FALSE),IF($H420=\"Volume\",$F420*VLOOKUP(\"Volume|\"&$G420,UOM_Conversions!$A$2:$E$50,4,FALSE),$F420*VLOOKUP(\"Each|\"&$G420,UOM_Conversions!$A$2:$E$50,4,FALSE))))","v":""},""]
[{"$nulls":9},{"$f":"IF($B421=\"\",\"\",IF($H421=\"Weight\",$F421*VLOOKUP(\"Weight|\"&$G421,UOM_Conversions!$A$2:$E$50,4,FALSE),IF($H421=\"Volume\",$F421*VLOOKUP(\"Volume|\"&$G421,UOM_Conversions!$A$2:$E$50,4,FALSE),$F421*VLOOKUP(\"Each|\"&$G421,UOM_Conversions!$A$2:$E$50,4,FALSE))))","v":""},""]
[{"$nulls":9},{"$f":"IF($B422=\"\",\"\",IF($H422=\"Weight\",$F422*VLOOKUP(\"Weight|\"&$G422,UOM_Conversions!$A$2:$E$50,4,FALSE),IF($H422=\"Volume\",$F422*VLOOKUP(\"Volume|\"&$G422,UOM_Conversions!$A$2:$E$50,4,FALSE),$F422*VLOOKUP(\"Each|\"&$G422,UOM_Conversions!$A$2:$E$50,4,FALSE))))","v":""},""]
[{"$nulls":9},{"$f":"IF($B423=\"\",\"\",IF($H423=\"Weight\",$F423*VLOOKUP(\"Weight|\"&$G423,UOM_Conversions!$A$2:$E$50,4,FALSE),IF($H423=\"Volume\",$F423*VLOOKUP(\"Volume|\"&$G423,UOM_Conversions!$A$2:$E$50,4,FALSE),$F423*VLOOKUP(\"Each|\"&$G423,UOM_Conversions!$A$2:$E$50,4,FALSE))))","v":""},""]
[{"$nulls":9},{"$f":"IF($B424=\"\",\"\",IF($H424=\"Weight\",$F424*VLOOKUP(\"Weight|\"&$G424,UOM_Conversions!$A$2:$E$50,4,FALSE),IF($H424=\"Volume\",$F424*VLOOKUP(\"Volume|\"&$G424,UOM_Conversions!$A$2:$E$50,4,FALSE),$F424*VLOOKUP(\"Each|\"&$G424,UOM_Conversions!$A$2:$E$50,4,FALSE))))","v":""},""]
[{"$nulls":9},{"$f":"IF($B425=\"\",\"\",IF($H425=\"Weight\",$F425*VLOOKUP(\"Weight|\"&$G425,UOM_Conversions!$A$2:$E$50,4,FALSE),IF($H425=\"Volume\",$F425*VLOOKUP(\"Volume|\"&$G425,UOM_Conversions!$A$2:$E$50,4,FALSE),$F425*VLOOKUP(\"Each|\"&$G425,UOM_Conversions!$A$2:$E$50,4,FALSE))))","v":""},""]
[{"$nulls":9},{"$f":"IF($B426=\"\",\"\",IF($H426=\"Weight\",$F426*VLOOKUP(\"Weight|\"&$G426,UOM_Conversions!$A$2:$E$50,4,FALSE),IF($H426=\"Volume\",$F426*VLOOKUP(\"Volume|\"&$G426,UOM_Conversions!$A$2:$E$50,4,FALSE),$F426*VLOOKUP(\"Each|\"&$G426,UOM_Conversions!$A$2:$E$50,4,FALSE))))","v":""},""]
[{"$nulls":9},{"$f":"IF($B427=\"\",\"\",IF($H427=\"Weight\",$F427*VLOOKUP(\"Weight|\"&$G427,UOM_Conversions!$A$2:$E$50,4,FALSE),IF($H427=\"Volume\",$F427*VLOOKUP(\"Volume|\"&$G427,UOM_Conversions!$A$2:$E$50,4,FALSE),$F427*VLOOKUP(\"Each|\"&$G427,UOM_Conversions!$A$2:$E$50,4,FALSE))))","v":""},""]
[{"$nulls":9},{"$f":"IF($B428=\"\",\"\",IF($H428=\"Weight\",$F428*VLOOKUP(\"Weight|\"&$G428,UOM_Conversions!$A$2:$E$50,4,FALSE),IF($H428=\"Volume\",$F428*VLOOKUP(\"Volume|\"&$G428,UOM_Conversions!$A$2:$E$50,4,FALSE),$F428*VLOOKUP(\"Each|\"&$G428,UOM_Conversions!$A$2:$E$50,4,FALSE))))","v":""},""]
[{"$nulls":9},{"$f":"IF($B429=\"\",\"\",IF($H429=\"Weight\",$F429*VLOOKUP(\"Weight|\"&$G429,UOM_Conversions!$A$2:$E$50,4,FALSE),IF($H429=\"Volume\",$F429*VLOOKUP(\"Volume|\"&$G429,UOM_Conversions!$A$2:$E$50,4,FALSE),$F429*VLOOKUP(\"Each|\"&$G429,UOM_Conversions!$A$2:$E$50,4,FALSE))))","v":""},""]
[{"$nulls":9},{"$f":"IF($B430=\"\",\"\",IF($H430=\"Weight\",$F430*VLOOKUP(\"Weight|\"&$G430,UOM_Conversions!$A$2:$E$50,4,FALSE),IF($H430=\"Volume\",$F430*VLOOKUP(\"Volume|\"&$G430,UOM_Conversions!$A$2:$E$50,4,FALSE),$F430*VLOOKUP(\"Each|\"&$G430,UOM_Conversions!$A$2:$E$50,4,FALSE))))","v":""},""]
[{"$nulls":9},{"$f":"IF($B431=\"\",\"\",IF($H431=\"Weight\",$F431*VLOOKUP(\"Weight|\"&$G431,UOM_Conversions!$A$2:$E$50,4,FALSE),IF($H431=\"Volume\",$F431*VLOOKUP(\"Volume|\"&$G431,UOM_Conversions!$A$2:$E$50,4,FALSE),$F431*VLOOKUP(\"Each|\"&$G431,UOM_Conversions!$A$2:$E$50,4,FALSE))))","v":""},""]
[{"$nulls":9},{"$f":"IF($B432=\"\",\"\",IF($H432=\"Weight\",$F432*VLOOKUP(\"Weight|\"&$G432,UOM_Conversions!$A$2:$E$50,4,FALSE),IF($H432=\"Volume\",$F432*VLOOKUP(\"Volume|\"&$G432,UOM_Conversions!$A$2:$E$50,4,FALSE),$F432*VLOOKUP(\"Each|\"&$G432,UOM_Conversions!$A$2:$E$50,4,FALSE))))","v":""},""]
[{"$nulls":9},{"$f":"IF($B433=\"\",\"\",IF($H433=\"Weight\",$F433*VLOOKUP(\"Weight|\"&$G433,UOM_Conversions!$A$2:$E$50,4,FALSE),IF($H433=\"Volume\",$F433*VLOOKUP(\"Volume|\"&$G433,UOM_Conversions!$A$2:$E$50,4,FALSE),$F433*VLOOKUP(\"Each|\"&$G433,UOM_Conversions!$A$2:$E$50,4,FALSE))))","v":""},""]
[{"$nulls":9},{"$f":"IF($B434=\"\",\"\",IF($H434=\"Weight\",$F434*VLOOKUP(\"Weight|\"&$G434,UOM_Conversions!$A$2:$E$50,4,FALSE),IF($H434=\"Volume\",$F434*VLOOKUP(\"Volume|\"&$G434,UOM_Conversions!$A$2:$E$50,4,FALSE),$F434*VLOOKUP(\"Each|\"&$G434,UOM_Conversions!$A$2:$E$50,4,FALSE))))","v":""},""]
[{"$nulls":9},{"$f":"IF($B435=\"\",\"\",IF($H435=\"Weight\",$F435*VLOOKUP(\"Weight|\"&$G435,UOM_Conversions!$A$2:$E$50,4,FALSE),IF($H435=\"Volume\",$F435*VLOOKUP(\"Volume|\"&$G435,UOM_Conversions!$A$2:$E$50,4,FALSE),$F435*VLOOKUP(\"Each|\"&$G435,UOM_Conversions!$A$2:$E$50,4,FALSE))))","v":""},""]
[{"$nulls":9},{"$f":"IF($B436=\"\",\"\",IF($H436=\"Weight\",$F436*VLOOKUP(\"Weight|\"&$G436,UOM_Conversions!$A$2:$E$50,4,FALSE),IF($H436=\"Volume\",$F436*VLOOKUP(\"Volume|\"&$G436,UOM_Conversions!$A$2:$E$50,4,FALSE),$F436*VLOOKUP(\"Each|\"&$G436,UOM_Conversions!$A$2:$E$50,4,FALSE))))","v":""},""]
[{"$nulls":9},{"$f":"IF($B437=\"\",\"\",IF($H437=\"Weight\",$F437*VLOOKUP(\"Weight|\"&$G437,UOM_Conversions!$A$2:$E$50,4,FALSE),IF($H437=\"Volume\",$F437*VLOOKUP(\"Volume|\"&$G437,UOM_Conversions!$A$2:$E$50,4,FALSE),$F437*VLOOKUP(\"Each|\"&$G437,UOM_Conversions!$A$2:$E$50,4,FALSE))))","v":""},""]
[{"$nulls":9},{"$f":"IF($B438=\"\",\"\",IF($H438=\"Weight\",$F438*VLOOKUP(\"Weight|\"&$G438,UOM_Conversions!$A$2:$E$50,4,FALSE),IF($H438=\"Volume\",$F438*VLOOKUP(\"Volume|\"&$G438,UOM_Conversions!$A$2:$E$50,4,FALSE),$F438*VLOOKUP(\"Each|\"&$G438,UOM_Conversions!$A$2:$E$50,4,FALSE))))","v":""},""]
[{"$nulls":9},{"$f":"IF($B439=\"\",\"\",IF($H439=\"Weight\",$F439*VLOOKUP(\"Weight|\"&$G439,UOM_Conversions!$A$2:$E$50,4,FALSE),IF($H439=\"Volume\",$F439*VLOOKUP(\"Volume|\"&$G439,UOM_Conversions!$A$2:$E$50,4,FALSE),$F439*VLOOKUP(\"Each|\"&$G439,UOM_Conversions!$A$2:$E$50,4,FALSE))))","v":""},""]
[{"$nulls":9},{"$f":"IF($B440=\"\",\"\",IF($H440=\"Weight\",$F440*VLOOKUP(\"Weight|\"&$G440,UOM_Conversions!$A$2:$E$50,4,FALSE),IF($H440=\"Volume\",$F440*VLOOKUP(\"Volume|\"&$G440,UOM_Conversions!$A$2:$E$50,4,FALSE),$F440*VLOOKUP(\"Each|\"&$G440,UOM_Conversions!$A$2:$E$50,4,FALSE))))","v":""},""]
[{"$nulls":9},{"$f":"IF($B441=\"\",\"\",IF($H441=\"Weight\",$F441*VLOOKUP(\"Weight|\"&$G441,UOM_Conversions!$A$2:$E$50,4,FALSE),IF($H441=\"Volume\",$F441*VLOOKUP(\"Volume|\"&$G441,UOM_Conversions!$A$2:$E$50,4,FALSE),$F441*VLOOKUP(\"Each|\"&$G441,UOM_Conversions!$A$2:$E$50,4,FALSE))))","v":""},""]
[{"$nulls":9},{"$f":"IF($B442=\"\",\"\",IF($H442=\"Weight\",$F442*VLOOKUP(\"Weight|\"&$G442,UOM_Conversions!$A$2:$E$50,4,FALSE),IF($H442=\"Volume\",$F442*VLOOKUP(\"Volume|\"&$G442,UOM_Conversions!$A$2:$E$50,4,FALSE),$F442*VLOOKUP(\"Each|\"&$G442,UOM_Conversions!$A$2:$E$50,4,FALSE))))","v":""},""]
[{"$nulls":9},{"$f":"IF($B443=\"\",\"\",IF($H443=\"Weight\",$F443*VLOOKUP(\"Weight|\"&$G443,UOM_Conversions!$A$2:$E$50,4,FALSE),IF($H443=\"Volume\",$F443*VLOOKUP(\"Volume|\"&$G443,UOM_Conversions!$A$2:$E$50,4,FALSE),$F443*VLOOKUP(\"Each|\"&$G443,UOM_Conversions!$A$2:$E$50,4,FALSE))))","v":""},""]
[{"$nulls":9},{"$f":"IF($B444=\"\",\"\",IF($H444=\"Weight\",$F444*VLOOKUP(\"Weight|\"&$G444,UOM_Conversions!$A$2:$E$50,4,FALSE),IF($H444=\"Volume\",$F444*VLOOKUP(\"Volume|\"&$G444,UOM_Conversions!$A$2:$E$50,4,FALSE),$F444*VLOOKUP(\"Each|\"&$G444,UOM_Conversions!$A$2:$E$50,4,FALSE))))","v":""},""]
[{"$nulls":9},{"$f":"IF($B445=\"\",\"\",IF($H445=\"Weight\",$F445*VLOOKUP(\"Weight|\"&$G445,UOM_Conversions!$A$2:$E$50,4,FALSE),IF($H445=\"Volume\",$F445*VLOOKUP(\"Volume|\"&$G445,UOM_Conversions!$A$2:$E$50,4,FALSE),$F445*VLOOKUP(\"Each|\"&$G445,UOM_Conversions!$A$2:$E$50,4,FALSE))))","v":""},""]
[{"$nulls":9},{"$f":"IF($B446=\"\",\"\",IF($H446=\"Weight\",$F446*VLOOKUP(\"Weight|\"&$G446,UOM_Conversions!$A$2:$E$50,4,FALSE),IF($H446=\"Volume\",$F446*VLOOKUP(\"Volume|\"&$G446,UOM_Conversions!$A$2:$E$50,4,FALSE),$F446*VLOOKUP(\"Each|\"&$G446,UOM_Conversions!$A$2:$E$50,4,FALSE))))","v":""},""]
[{"$nulls":9},{"$f":"IF($B447=\"\",\"\",IF($H447=\"Weight\",$F447*VLOOKUP(\"Weight|\"&$G447,UOM_Conversions!$A$2:$E$50,4,FALSE),IF($H447=\"Volume\",$F447*VLOOKUP(\"Volume|\"&$G447,UOM_Conversions!$A$2:$E$50,4,FALSE),$F447*VLOOKUP(\"Each|\"&$G447,UOM_Conversions!$A$2:$E$50,4,FALSE))))","v":""},""]
[{"$nulls":9},{"$f":"IF($B448=\"\",\"\",IF($H448=\"Weight\",$F448*VLOOKUP(\"Weight|\"&$G448,UOM_Conversions!$A$2:$E$50,4,FALSE),IF($H448=\"Volume\",$F448*VLOOKUP(\"Volume|\"&$G448,UOM_Conversions!$A$2:$E$50,4,FALSE),$F448*VLOOKUP(\"Each|\"&$G448,UOM_Conversions!$A$2:$E$50,4,FALSE))))","v":""},""]
[{"$nulls":9},{"$f":"IF($B449=\"\",\"\",IF($H449=\"Weight\",$F449*VLOOKUP(\"Weight|\"&$G449,UOM_Conversions!$A$2:$E$50,4,FALSE),IF($H449=\"Volume\",$F449*VLOOKUP(\"Volume|\"&$G449,UOM_Conversions!$A$2:$E$50,4,FALSE),$F449*VLOOKUP(\"Each|\"&$G449,UOM_Conversions!$A$2:$E$50,4,FALSE))))","v":""},""]
[{"$nulls":9},{"$f":"IF($B450=\"\",\"\",IF($H450=\"Weight\",$F450*VLOOKUP(\"Weight|\"&$G450,UOM_Conversions!$A$2:$E$50,4,FALSE),IF($H450=\"Volume\",$F450*VLOOKUP(\"Volume|\"&$G450,UOM_Conversions!$A$2:$E$50,4,FALSE),$F450*VLOOKUP(\"Each|\"&$G450,UOM_Conversions!$A$2:$E$50,4,FALSE))))","v":""},{"$f":"IF($B450=\"\",\"\",IFERROR($E450/$J450,0))","v":""}]
[{"$nulls":9},{"$f":"IF($B451=\"\",\"\",IF($H451=\"Weight\",$F451*VLOOKUP(\"Weight|\"&$G451,UOM_Conversions!$A$2:$E$50,4,FALSE),IF($H451=\"Volume\",$F451*VLOOKUP(\"Volume|\"&$G451,UOM_Conversions!$A$2:$E$50,4,FALSE),$F451*VLOOKUP(\"Each|\"&$G451,UOM_Conversions!$A$2:$E$50,4,FALSE))))","v":""},""]
[{"$nulls":9},{"$f":"IF($B452=\"\",\"\",IF($H452=\"Weight\",$F452*VLOOKUP(\"Weight|\"&$G452,UOM_Conversions!$A$2:$E$50,4,FALSE),IF($H452=\"Volume\",$F452*VLOOKUP(\"Volume|\"&$G452,UOM_Conversions!$A$2:$E$50,4,FALSE),$F452*VLOOKUP(\"Each|\"&$G452,UOM_Conversions!$A$2:$E$50,4,FALSE))))","v":""},""]
[{"$nulls":9},{"$f":"IF($B453=\"\",\"\",IF($H453=\"Weight\",$F453*VLOOKUP(\"Weight|\"&$G453,UOM_Conversions!$A$2:$E$50,4,FALSE),IF($H453=\"Volume\",$F453*VLOOKUP(\"Volume|\"&$G453,UOM_Conversions!$A$2:$E$50,4,FALSE),$F453*VLOOKUP(\"Each|\"&$G453,UOM_Conversions!$A$2:$E$50,4,FALSE))))","v":""},""]
[{"$nulls":9},{"$f":"IF($B454=\"\",\"\",IF($H454=\"Weight\",$F454*VLOOKUP(\"Weight|\"&$G454,UOM_Conversions!$A$2:$E$50,4,FALSE),IF($H454=\"Volume\",$F454*VLOOKUP(\"Volume|\"&$G454,UOM_Conversions!$A$2:$E$50,4,FALSE),$F454*VLOOKUP(\"Each|\"&$G454,UOM_Conversions!$A$2:$E$50,4,FALSE))))","v":""},""]
[{"$nulls":9},{"$f":"IF($B455=\"\",\"\",IF($H455=\"Weight\",$F455*VLOOKUP(\"Weight|\"&$G455,UOM_Conversions!$A$2:$E$50,4,FALSE),IF($H455=\"Volume\",$F455*VLOOKUP(\"Volume|\"&$G455,UOM_Conversions!$A$2:$E$50,4,FALSE),$F455*VLOOKUP(\"Each|\"&$G455,UOM_Conversions!$A$2:$E$50,4,FALSE))))","v":""},""]
[{"$nulls":9},{"$f":"IF($B456=\"\",\"\",IF($H456=\"Weight\",$F456*VLOOKUP(\"Weight|\"&$G456,UOM_Conversions!$A$2:$E$50,4,FALSE),IF($H456=\"Volume\",$F456*VLOOKUP(\"Volume|\"&$G456,UOM_Conversions!$A$2:$E$50,4,FALSE),$F456*VLOOKUP(\"Each|\"&$G456,UOM_Conversions!$A$2:$E$50,4,FALSE))))","v":""},""]
[{"$nulls":9},{"$f":"IF($B457=\"\",\"\",IF($H457=\"Weight\",$F457*VLOOKUP(\"Weight|\"&$G457,UOM_Conversions!$A$2:$E$50,4,FALSE),IF($H457=\"Volume\",$F457*VLOOKUP(\"Volume|\"&$G457,UOM_Conversions!$A$2:$E$50,4,FALSE),$F457*VLOOKUP(\"Each|\"&$G457,UOM_Conversions!$A$2:$E$50,4,FALSE))))","v":""},""]
[{"$nulls":9},{"$f":"IF($B458=\"\",\"\",IF($H458=\"Weight\",$F458*VLOOKUP(\"Weight|\"&$G458,UOM_Conversions!$A$2:$E$50,4,FALSE),IF($H458=\"Volume\",$F458*VLOOKUP(\"Volume|\"&$G458,UOM_Conversions!$A$2:$E$50,4,FALSE),$F458*VLOOKUP(\"Each|\"&$G458,UOM_Conversions!$A$2:$E$50,4,FALSE))))","v":""},""]
[{"$nulls":9},{"$f":"IF($B459=\"\",\"\",IF($H459=\"Weight\",$F459*VLOOKUP(\"Weight|\"&$G459,UOM_Conversions!$A$2:$E$50,4,FALSE),IF($H459=\"Volume\",$F459*VLOOKUP(\"Volume|\"&$G459,UOM_Conversions!$A$2:$E$50,4,FALSE),$F459*VLOOKUP(\"Each|\"&$G459,UOM_Conversions!$A$2:$E$50,4,FALSE))))","v":""},""]
[{"$nulls":9},{"$f":"IF($B460=\"\",\"\",IF($H460=\"Weight\",$F460*VLOOKUP(\"Weight|\"&$G460,UOM_Conversions!$A$2:$E$50,4,FALSE),IF($H460=\"Volume\",$F460*VLOOKUP(\"Volume|\"&$G460,UOM_Conversions!$A$2:$E$50,4,FALSE),$F460*VLOOKUP(\"Each|\"&$G460,UOM_Conversions!$A$2:$E$50,4,FALSE))))","v":""},""]
[{"$nulls":9},{"$f":"IF($B461=\"\",\"\",IF($H461=\"Weight\",$F461*VLOOKUP(\"Weight|\"&$G461,UOM_Conversions!$A$2:$E$50,4,FALSE),IF($H461=\"Volume\",$F461*VLOOKUP(\"Volume|\"&$G461,UOM_Conversions!$A$2:$E$50,4,FALSE),$F461*VLOOKUP(\"Each|\"&$G461,UOM_Conversions!$A$2:$E$50,4,FALSE))))","v":""},""]
[{"$nulls":9},{"$f":"IF($B462=\"\",\"\",IF($H462=\"Weight\",$F462*VLOOKUP(\"Weight|\"&$G462,UOM_Conversions!$A$2:$E$50,4,FALSE),IF($H462=\"Volume\",$F462*VLOOKUP(\"Volume|\"&$G462,UOM_Conversions!$A$2:$E$50,4,FALSE),$F462*VLOOKUP(\"Each|\"&$G462,UOM_Conversions!$A$2:$E$50,4,FALSE))))","v":""},""]
[{"$nulls":9},{"$f":"IF($B463=\"\",\"\",IF($H463=\"Weight\",$F463*VLOOKUP(\"Weight|\"&$G463,UOM_Conversions!$A$2:$E$50,4,FALSE),IF($H463=\"Volume\",$F463*VLOOKUP(\"Volume|\"&$G463,UOM_Conversions!$A$2:$E$50,4,FALSE),$F463*VLOOKUP(\"Each|\"&$G463,UOM_Conversions!$A$2:$E$50,4,FALSE))))","v":""},""]
[{"$nulls":9},{"$f":"IF($B464=\"\",\"\",IF($H464=\"Weight\",$F464*VLOOKUP(\"Weight|\"&$G464,UOM_Conversions!$A$2:$E$50,4,FALSE),IF($H464=\"Volume\",$F464*VLOOKUP(\"Volume|\"&$G464,UOM_Conversions!$A$2:$E$50,4,FALSE),$F464*VLOOKUP(\"Each|\"&$G464,UOM_Conversions!$A$2:$E$50,4,FALSE))))","v":""},""]
[{"$nulls":9},{"$f":"IF($B465=\"\",\"\",IF($H465=\"Weight\",$F465*VLOOKUP(\"Weight|\"&$G465,UOM_Conversions!$A$2:$E$50,4,FALSE),IF($H465=\"Volume\",$F465*VLOOKUP(\"Volume|\"&$G465,UOM_Conversions!$A$2:$E$50,4,FALSE),$F465*VLOOKUP(\"Each|\"&$G465,UOM_Conversions!$A$2:$E$50,4,FALSE))))","v":""},""]
[{"$nulls":9},{"$f":"IF($B466=\"\",\"\",IF($H466=\"Weight\",$F466*VLOOKUP(\"Weight|\"&$G466,UOM_Conversions!$A$2:$E$50,4,FALSE),IF($H466=\"Volume\",$F466*VLOOKUP(\"Volume|\"&$G466,UOM_Conversions!$A$2:$E$50,4,FALSE),$F466*VLOOKUP(\"Each|\"&$G466,UOM_Conversions!$A$2:$E$50,4,FALSE))))","v":""},""]
[{"$nulls":9},{"$f":"IF($B467=\"\",\"\",IF($H467=\"Weight\",$F467*VLOOKUP(\"Weight|\"&$G467,UOM_Conversions!$A$2:$E$50,4,FALSE),IF($H467=\"Volume\",$F467*VLOOKUP(\"Volume|\"&$G467,UOM_Conversions!$A$2:$E$50,4,FALSE),$F467*VLOOKUP(\"Each|\"&$G467,UOM_Conversions!$A$2:$E$50,4,FALSE))))","v":""},""]
[{"$nulls":9},{"$f":"IF($B468=\"\",\"\",IF($H468=\"Weight\",$F468*VLOOKUP(\"Weight|\"&$G468,UOM_Conversions!$A$2:$E$50,4,FALSE),IF($H468=\"Volume\",$F468*VLOOKUP(\"Volume|\"&$G468,UOM_Conversions!$A$2:$E$50,4,FALSE),$F468*VLOOKUP(\"Each|\"&$G468,UOM_Conversions!$A$2:$E$50,4,FALSE))))","v":""},""]
[{"$nulls":9},{"$f":"IF($B469=\"\",\"\",IF($H469=\"Weight\",$F469*VLOOKUP(\"Weight|\"&$G469,UOM_Conversions!$A$2:$E$50,4,FALSE),IF($H469=\"Volume\",$F469*VLOOKUP(\"Volume|\"&$G469,UOM_Conversions!$A$2:$E$50,4,FALSE),$F469*VLOOKUP(\"Each|\"&$G469,UOM_Conversions!$A$2:$E$50,4,FALSE))))","v":""},""]
[{"$nulls":9},{"$f":"IF($B470=\"\",\"\",IF($H470=\"Weight\",$F470*VLOOKUP(\"Weight|\"&$G470,UOM_Conversions!$A$2:$E$50,4,FALSE),IF($H470=\"Volume\",$F470*VLOOKUP(\"Volume|\"&$G470,UOM_Conversions!$A$2:$E$50,4,FALSE),$F470*VLOOKUP(\"Each|\"&$G470,UOM_Conversions!$A$2:$E$50,4,FALSE))))","v":""},""]
[{"$nulls":9},{"$f":"IF($B471=\"\",\"\",IF($H471=\"Weight\",$F471*VLOOKUP(\"Weight|\"&$G471,UOM_Conversions!$A$2:$E$50,4,FALSE),IF($H471=\"Volume\",$F471*VLOOKUP(\"Volume|\"&$G471,UOM_Conversions!$A$2:$E$50,4,FALSE),$F471*VLOOKUP(\"Each|\"&$G471,UOM_Conversions!$A$2:$E$50,4,FALSE))))","v":""},""]
[{"$nulls":9},{"$f":"IF($B472=\"\",\"\",IF($H472=\"Weight\",$F472*VLOOKUP(\"Weight|\"&$G472,UOM_Conversions!$A$2:$E$50,4,FALSE),IF($H472=\"Volume\",$F472*VLOOKUP(\"Volume|\"&$G472,UOM_Conversions!$A$2:$E$50,4,FALSE),$F472*VLOOKUP(\"Each|\"&$G472,UOM_Conversions!$A$2:$E$50,4,FALSE))))","v":""},""]
[{"$nulls":9},{"$f":"IF($B473=\"\",\"\",IF($H473=\"Weight\",$F473*VLOOKUP(\"Weight|\"&$G473,UOM_Conversions!$A$2:$E$50,4,FALSE),IF($H473=\"Volume\",$F473*VLOOKUP(\"Volume|\"&$G473,UOM_Conversions!$A$2:$E$50,4,FALSE),$F473*VLOOKUP(\"Each|\"&$G473,UOM_Conversions!$A$2:$E$50,4,FALSE))))","v":""},""]
[{"$nulls":9},{"$f":"IF($B474=\"\",\"\",IF($H474=\"Weight\",$F474*VLOOKUP(\"Weight|\"&$G474,UOM_Conversions!$A$2:$E$50,4,FALSE),IF($H474=\"Volume\",$F474*VLOOKUP(\"Volume|\"&$G474,UOM_Conversions!$A$2:$E$50,4,FALSE),$F474*VLOOKUP(\"Each|\"&$G474,UOM_Conversions!$A$2:$E$50,4,FALSE))))","v":""},""]
[{"$nulls":9},{"$f":"IF($B475=\"\",\"\",IF($H475=\"Weight\",$F475*VLOOKUP(\"Weight|\"&$G475,UOM_Conversions!$A$2:$E$50,4,FALSE),IF($H475=\"Volume\",$F475*VLOOKUP(\"Volume|\"&$G475,UOM_Conversions!$A$2:$E$50,4,FALSE),$F475*VLOOKUP(\"Each|\"&$G475,UOM_Conversions!$A$2:$E$50,4,FALSE))))","v":""},""]
[{"$nulls":9},{"$f":"IF($B476=\"\",\"\",IF($H476=\"Weight\",$F476*VLOOKUP(\"Weight|\"&$G476,UOM_Conversions!$A$2:$E$50,4,FALSE),IF($H476=\"Volume\",$F476*VLOOKUP(\"Volume|\"&$G476,UOM_Conversions!$A$2:$E$50,4,FALSE),$F476*VLOOKUP(\"Each|\"&$G476,UOM_Conversions!$A$2:$E$50,4,FALSE))))","v":""},""]
[{"$nulls":9},{"$f":"IF($B477=\"\",\"\",IF($H477=\"Weight\",$F477*VLOOKUP(\"Weight|\"&$G477,UOM_Conversions!$A$2:$E$50,4,FALSE),IF($H477=\"Volume\",$F477*VLOOKUP(\"Volume|\"&$G477,UOM_Conversions!$A$2:$E$50,4,FALSE),$F477*VLOOKUP(\"Each|\"&$G477,UOM_Conversions!$A$2:$E$50,4,FALSE))))","v":""},""]
[{"$nulls":9},{"$f":"IF($B478=\"\",\"\",IF($H478=\"Weight\",$F478*VLOOKUP(\"Weight|\"&$G478,UOM_Conversions!$A$2:$E$50,4,FALSE),IF($H478=\"Volume\",$F478*VLOOKUP(\"Volume|\"&$G478,UOM_Conversions!$A$2:$E$50,4,FALSE),$F478*VLOOKUP(\"Each|\"&$G478,UOM_Conversions!$A$2:$E$50,4,FALSE))))","v":""},""]
[{"$nulls":9},{"$f":"IF($B479=\"\",\"\",IF($H479=\"Weight\",$F479*VLOOKUP(\"Weight|\"&$G479,UOM_Conversions!$A$2:$E$50,4,FALSE),IF($H479=\"Volume\",$F479*VLOOKUP(\"Volume|\"&$G479,UOM_Conversions!$A$2:$E$50,4,FALSE),$F479*VLOOKUP(\"Each|\"&$G479,UOM_Conversions!$A$2:$E$50,4,FALSE))))","v":""},""]
[{"$nulls":9},{"$f":"IF($B480=\"\",\"\",IF($H480=\"Weight\",$F480*VLOOKUP(\"Weight|\"&$G480,UOM_Conversions!$A$2:$E$50,4,FALSE),IF($H480=\"Volume\",$F480*VLOOKUP(\"Volume|\"&$G480,UOM_Conversions!$A$2:$E$50,4,FALSE),$F480*VLOOKUP(\"Each|\"&$G480,UOM_Conversions!$A$2:$E$50,4,FALSE))))","v":""},""]
[{"$nulls":9},{"$f":"IF($B481=\"\",\"\",IF($H481=\"Weight\",$F481*VLOOKUP(\"Weight|\"&$G481,UOM_Conversions!$A$2:$E$50,4,FALSE),IF($H481=\"Volume\",$F481*VLOOKUP(\"Volume|\"&$G481,UOM_Conversions!$A$2:$E$50,4,FALSE),$F481*VLOOKUP(\"Each|\"&$G481,UOM_Conversions!$A$2:$E$50,4,FALSE))))","v":""},""]
[{"$nulls":9},{"$f":"IF($B482=\"\",\"\",IF($H482=\"Weight\",$F482*VLOOKUP(\"Weight|\"&$G482,UOM_Conversions!$A$2:$E$50,4,FALSE),IF($H482=\"Volume\",$F482*VLOOKUP(\"Volume|\"&$G482,UOM_Conversions!$A$2:$E$50,4,FALSE),$F482*VLOOKUP(\"Each|\"&$G482,UOM_Conversions!$A$2:$E$50,4,FALSE))))","v":""},""]
[{"$nulls":9},{"$f":"IF($B483=\"\",\"\",IF($H483=\"Weight\",$F483*VLOOKUP(\"Weight|\"&$G483,UOM_Conversions!$A$2:$E$50,4,FALSE),IF($H483=\"Volume\",$F483*VLOOKUP(\"Volume|\"&$G483,UOM_Conversions!$A$2:$E$50,4,FALSE),$F483*VLOOKUP(\"Each|\"&$G483,UOM_Conversions!$A$2:$E$50,4,FALSE))))","v":""},""]
[{"$nulls":9},{"$f":"IF($B484=\"\",\"\",IF($H484=\"Weight\",$F484*VLOOKUP(\"Weight|\"&$G484,UOM_Conversions!$A$2:$E$50,4,FALSE),IF($H484=\"Volume\",$F484*VLOOKUP(\"Volume|\"&$G484,UOM_Conversions!$A$2:$E$50,4,FALSE),$F484*VLOOKUP(\"Each|\"&$G484,UOM_Conversions!$A$2:$E$50,4,FALSE))))","v":""},""]
[{"$nulls":9},{"$f":"IF($B485=\"\",\"\",IF($H485=\"Weight\",$F485*VLOOKUP(\"Weight|\"&$G485,UOM_Conversions!$A$2:$E$50,4,FALSE),IF($H485=\"Volume\",$F485*VLOOKUP(\"Volume|\"&$G485,UOM_Conversions!$A$2:$E$50,4,FALSE),$F485*VLOOKUP(\"Each|\"&$G485,UOM_Conversions!$A$2:$E$50,4,FALSE))))","v":""},""]
[{"$nulls":9},{"$f":"IF($B486=\"\",\"\",IF($H486=\"Weight\",$F486*VLOOKUP(\"Weight|\"&$G486,UOM_Conversions!$A$2:$E$50,4,FALSE),IF($H486=\"Volume\",$F486*VLOOKUP(\"Volume|\"&$G486,UOM_Conversions!$A$2:$E$50,4,FALSE),$F486*VLOOKUP(\"Each|\"&$G486,UOM_Conversions!$A$2:$E$50,4,FALSE))))","v":""},""]
[{"$nulls":9},{"$f":"IF($B487=\"\",\"\",IF($H487=\"Weight\",$F487*VLOOKUP(\"Weight|\"&$G487,UOM_Conversions!$A$2:$E$50,4,FALSE),IF($H487=\"Volume\",$F487*VLOOKUP(\"Volume|\"&$G487,UOM_Conversions!$A$2:$E$50,4,FALSE),$F487*VLOOKUP(\"Each|\"&$G487,UOM_Conversions!$A$2:$E$50,4,FALSE))))","v":""},""]
[{"$nulls":9},{"$f":"IF($B488=\"\",\"\",IF($H488=\"Weight\",$F488*VLOOKUP(\"Weight|\"&$G488,UOM_Conversions!$A$2:$E$50,4,FALSE),IF($H488=\"Volume\",$F488*VLOOKUP(\"Volume|\"&$G488,UOM_Conversions!$A$2:$E$50,4,FALSE),$F488*VLOOKUP(\"Each|\"&$G488,UOM_Conversions!$A$2:$E$50,4,FALSE))))","v":""},""]
[{"$nulls":9},{"$f":"IF($B489=\"\",\"\",IF($H489=\"Weight\",$F489*VLOOKUP(\"Weight|\"&$G489,UOM_Conversions!$A$2:$E$50,4,FALSE),IF($H489=\"Volume\",$F489*VLOOKUP(\"Volume|\"&$G489,UOM_Conversions!$A$2:$E$50,4,FALSE),$F489*VLOOKUP(\"Each|\"&$G489,UOM_Conversions!$A$2:$E$50,4,FALSE))))","v":""},""]
[{"$nulls":9},{"$f":"IF($B490=\"\",\"\",IF($H490=\"Weight\",$F490*VLOOKUP(\"Weight|\"&$G490,UOM_Conversions!$A$2:$E$50,4,FALSE),IF($H490=\"Volume\",$F490*VLOOKUP(\"Volume|\"&$G490,UOM_Conversions!$A$2:$E$50,4,FALSE),$F490*VLOOKUP(\"Each|\"&$G490,UOM_Conversions!$A$2:$E$50,4,FALSE))))","v":""},""]
[{"$nulls":9},{"$f":"IF($B491=\"\",\"\",IF($H491=\"Weight\",$F491*VLOOKUP(\"Weight|\"&$G491,UOM_Conversions!$A$2:$E$50,4,FALSE),IF($H491=\"Volume\",$F491*VLOOKUP(\"Volume|\"&$G491,UOM_Conversions!$A$2:$E$50,4,FALSE),$F491*VLOOKUP(\"Each|\"&$G491,UOM_Conversions!$A$2:$E$50,4,FALSE))))","v":""},""]
[{"$nulls":9},{"$f":"IF($B492=\"\",\"\",IF($H492=\"Weight\",$F492*VLOOKUP(\"Weight|\"&$G492,UOM_Conversions!$A$2:$E$50,4,FALSE),IF($H492=\"Volume\",$F492*VLOOKUP(\"Volume|\"&$G492,UOM_Conversions!$A$2:$E$50,4,FALSE),$F492*VLOOKUP(\"Each|\"&$G492,UOM_Conversions!$A$2:$E$50,4,FALSE))))","v":""},""]
[{"$nulls":9},{"$f":"IF($B493=\"\",\"\",IF($H493=\"Weight\",$F493*VLOOKUP(\"Weight|\"&$G493,UOM_Conversions!$A$2:$E$50,4,FALSE),IF($H493=\"Volume\",$F493*VLOOKUP(\"Volume|\"&$G493,UOM_Conversions!$A$2:$E$50,4,FALSE),$F493*VLOOKUP(\"Each|\"&$G493,UOM_Conversions!$A$2:$E$50,4,FALSE))))","v":""},""]
[{"$nulls":9},{"$f":"IF($B494=\"\",\"\",IF($H494=\"Weight\",$F494*VLOOKUP(\"Weight|\"&$G494,UOM_Conversions!$A$2:$E$50,4,FALSE),IF($H494=\"Volume\",$F494*VLOOKUP(\"Volume|\"&$G494,UOM_Conversions!$A$2:$E$50,4,FALSE),$F494*VLOOKUP(\"Each|\"&$G494,UOM_Conversions!$A$2:$E$50,4,FALSE))))","v":""},""]
[{"$nulls":9},{"$f":"IF($B495=\"\",\"\",IF($H495=\"Weight\",$F495*VLOOKUP(\"Weight|\"&$G495,UOM_Conversions!$A$2:$E$50,4,FALSE),IF($H495=\"Volume\",$F495*VLOOKUP(\"Volume|\"&$G495,UOM_Conversions!$A$2:$E$50,4,FALSE),$F495*VLOOKUP(\"Each|\"&$G495,UOM_Conversions!$A$2:$E$50,4,FALSE))))","v":""},""]
[{"$nulls":9},{"$f":"IF($B496=\"\",\"\",IF($H496=\"Weight\",$F496*VLOOKUP(\"Weight|\"&$G496,UOM_Conversions!$A$2:$E$50,4,FALSE),IF($H496=\"Volume\",$F496*VLOOKUP(\"Volume|\"&$G496,UOM_Conversions!$A$2:$E$50,4,FALSE),$F496*VLOOKUP(\"Each|\"&$G496,UOM_Conversions!$A$2:$E$50,4,FALSE))))","v":""},""]
[{"$nulls":9},{"$f":"IF($B497=\"\",\"\",IF($H497=\"Weight\",$F497*VLOOKUP(\"Weight|\"&$G497,UOM_Conversions!$A$2:$E$50,4,FALSE),IF($H497=\"Volume\",$F497*VLOOKUP(\"Volume|\"&$G497,UOM_Conversions!$A$2:$E$50,4,FALSE),$F497*VLOOKUP(\"Each|\"&$G497,UOM_Conversions!$A$2:$E$50,4,FALSE))))","v":""},""]
[{"$nulls":9},{"$f":"IF($B498=\"\",\"\",IF($H498=\"Weight\",$F498*VLOOKUP(\"Weight|\"&$G498,UOM_Conversions!$A$2:$E$50,4,FALSE),IF($H498=\"Volume\",$F498*VLOOKUP(\"Volume|\"&$G498,UOM_Conversions!$A$2:$E$50,4,FALSE),$F498*VLOOKUP(\"Each|\"&$G498,UOM_Conversions!$A$2:$E$50,4,FALSE))))","v":""},""]
[{"$nulls":9},{"$f":"IF($B499=\"\",\"\",IF($H499=\"Weight\",$F499*VLOOKUP(\"Weight|\"&$G499,UOM_Conversions!$A$2:$E$50,4,FALSE),IF($H499=\"Volume\",$F499*VLOOKUP(\"Volume|\"&$G499,UOM_Conversions!$A$2:$E$50,4,FALSE),$F499*VLOOKUP(\"Each|\"&$G499,UOM_Conversions!$A$2:$E$50,4,FALSE))))","v":""},""]
[{"$nulls":9},{"$f":"IF($B500=\"\",\"\",IF($H500=\"Weight\",$F500*VLOOKUP(\"Weight|\"&$G500,UOM_Conversions!$A$2:$E$50,4,FALSE),IF($H500=\"Volume\",$F500*VLOOKUP(\"Volume|\"&$G500,UOM_Conversions!$A$2:$E$50,4,FALSE),$F500*VLOOKUP(\"Each|\"&$G500,UOM_Conversions!$A$2:$E$50,4,FALSE))))","v":""},""]
[{"$nulls":9},{"$f":"IF($B501=\"\",\"\",IF($H501=\"Weight\",$F501*VLOOKUP(\"Weight|\"&$G501,UOM_Conversions!$A$2:$E$50,4,FALSE),IF($H501=\"Volume\",$F501*VLOOKUP(\"Volume|\"&$G501,UOM_Conversions!$A$2:$E$50,4,FALSE),$F501*VLOOKUP(\"Each|\"&$G501,UOM_Conversions!$A$2:$E$50,4,FALSE))))","v":""},""]

{"sheet":"UOM_Conversions","index":3,"n_rows":12,"n_cols":7,"rows_kept":12}
["Key","Type","Unit","ToBaseFactor","BaseUnit",null,"Units_List"]
["Weight|g","Weight","g",{"v":1,"d":"1.00"},"g",null,"g"]
["Weight|kg","Weight","kg",{"v":1000,"d":"1000.00"},"g",null,"kg"]
["Weight|oz","Weight","oz",{"v":28.349523125,"d":"28.35"},"g",null,"oz"]
["Weight|lb","Weight","lb",{"v":453.59237,"d":"453.59"},"g",null,"lb"]
["Volume|ml","Volume","ml",{"v":1,"d":"1.00"},"ml",null,"ml"]
["Volume|l","Volume","l",{"v":1000,"d":"1000.00"},"ml",null,"l"]
["Volume|tsp","Volume","tsp",{"v":4.928921594,"d":"4.93"},"ml",null,"tsp"]
["Volume|tbsp","Volume","tbsp",{"v":14.786764781,"d":"14.79"},"ml",null,"tbsp"]
["Volume|cup","Volume","cup",{"v":236.5882365,"d":"236.59"},"ml",null,"cup"]
["Each|each","Each","each",{"v":1,"d":"1.00"},"each",null,"each"]
["Each|dozen","Each","dozen",{"v":12,"d":"12.00"},"each",null,"dozen"]

{"sheet":"HowTo","index":4,"n_rows":88,"n_cols":26,"rows_kept":88}
[null,"HOW TO USE THIS RECIPE COST WORKBOOK",{"$nulls":23},{"$f":"SUBSTITUTE(SUBSTITUTE(LEFT(CELL(\"filename\",B1),FIND(\"]\",CELL(\"filename\",B1))),\"[\",\"\"),\"]\",\"\")","v":"C:\\HFPNet\\Food_Recipe_Costing_Template.xlsm"}]
[]
[null,"Purpose"]
[null,"This workbook helps you:"]
[null,"1. Cost each menu item using one sheet per recipe"]
[null,"2. Automatically build a Summary table across all recipes using Power Query"]
[null,"3. copy and create new recipe sheets with click of a button"]
[null,"4. Track key KPIs: Cost/Portion, Food Cost %, Last Updated"]
[null,"5. Easy navogation summary sheet to recipes and back to summary"]
[]
[null,"Quick Start (3 steps)"]
[null,"1. Create a new recipe sheet by copying TEMPLATE"]
[null,"2. Fill the recipe sheet (ingredients + header details)"]
[null,"3. Save → Data → Refresh All to update the Summary"]
[]
[null,"1) Add a New Recipe (Recommended Workflow)"]
[null,"1. Click on Add new recipe button"]
[null,"2. Type in the recipe name on the popup"]
[null,"3. Update these header cells on the recipe sheet:"]
[]
[null,"Header cells Power Query reads (do not move these):"]
[null,"C3 Menu Item Name"]
[null,"C4 Category"]
[null,"C6 Yield (portions)"]
[null,"C8 Selling Price"]
[null,"F2 Last Updated"]
[null,"G7 Cost / Portion"]
[null,"G8 Food Cost %"]
[null,"G10 Gross Margin %"]
[null,"Once the sheet has a value in C3, it will appear in Summary after refresh."]
[]
[null,"2) Update an Existing Recipe"]
[null,"1. Open the recipe sheet"]
[null,"2. Update ingredients / quantities / prices / yield / selling price"]
[null,"3. Update Last Updated in F2"]
[null,"4. Save (Ctrl+S)"]
[null,"5. Go to Data → Refresh All or right click on any row of the summary table → click refresh"]
[]
[null,"3) Refresh the Summary (Power Query)"]
[null,"Power Query reads the saved workbook, so always save first."]
[null,"1. Ctrl + S (Save)"]
[null,"2. Go to Data → Refresh All or right click on any row of the summary table → click refresh"]
[null,"3. Summary updates automatically"]
[]
[null,"4) Renaming Recipe Sheets"]
[null,"Power Query will still work after renaming sheets."]
[null,"After renaming a recipe tab:"]
[null,"1. Save"]
[null,"2. Refresh All"]
[null,"No link breakage (this is one reason we use Power Query instead of excel links)."]
[]
[null,"COMMON MISTAKES (AND FIXES)"]
[null,"❌ Recipe missing from Summary"]
[null,"Cause: Menu Item Name (C3) is blank"]
[null,"Fix: Enter a menu item name in C3, save, refresh."]
[null,"❌ Summary values are blank or zero"]
[null,"Cause: The workbook layout changed or values are not in the expected cells"]
[null,"Fix: Confirm these cells contain the correct values:"]
[null,"Sell Price in C8"]
[null,"Cost/Portion in G7"]
[null,"Food Cost % in G8"]
[null,"Then save and refresh."]
[null,"❌ Summary not updating after changes"]
[null,"Cause: Workbook wasn’t saved before refresh"]
[null,"Fix: Ctrl+S then Refresh All"]
[null,"❌ Wrong yields or costs"]
[null,"Cause: Yield (C6) is incorrect or ingredients are not in the batch quantity"]
[null,"Fix: Confirm yield in C6 and ingredient units/conversions."]
[null,"❌ Template sheet is renamed or template details are included in the summary"]
[null,"Cause: Renaming, rearranging the order of the mandatory sheets or hiding the sheets (Template, Ingredients_DB, UOM_Conversions, HowTo)"]
[null,"Fix: Do not rename, rearrange order or hide mandatory sheets (Template, Ingredients_DB, UOM_Conversions, HowTo)"]
[]
[null,"CHANGE LOG (Optional but Recommended)"]
[null,"Use this to track changes to recipes and pricing."]
[]
[null,"Date","Recipe / Sheet Name","What Changed","Changed By","Notes"]
[]
[]
[null,"Best practice: When you change a recipe’s ingredients, yield, or selling price:"]
[null,"Update F2 Last Updated"]
[null,"Add a line in the Change Log (above)"]
[]
[null,"WORKFLOW CHECKLIST (Daily / Weekly)"]
[null,"Add new recipes by clicking on Add new recipe button"]
[null,"Keep header cells in the same locations"]
[null,"Update F2 “Last Updated” when changing anything important"]
[null,"Save and Refresh All before reporting/exporting"]
[null,"Review Summary filters (Category, high Food Cost %, low margin)"]

{"sheet":"Example 1","index":5,"n_rows":50,"n_cols":31,"rows_kept":50,"merged":[[1,12,14,12],[19,10,49,12]]}
["RECIPE COST CARD",{"$nulls":9},"ALLERGEN SUMMARY (from ingredient flags)",{"$nulls":3},"For calculation (do not delete)"]
["Restaurant / Concept",null,"Demo Restaurant",null,"Last Updated","2026-02-02",{"$nulls":4},"Milk",{"$f":"IF(MAX(R21:R50)>0,\"YES\",\"\")","v":"YES"},"(e.g., gluten-free option? vegan? substitution guidance, allergen handling, etc.)"]
["Menu Item Name",null,"Example 1",{"$nulls":3},"Currency 1","Currency 2","Notes",null,"Egg",{"$f":"IF(MAX(S21:S50)>0,\"YES\",\"\")","v":"YES"}]
["Category",null,"Starter",null,"Total Batch Food Cost",null,{"$f":"IFERROR(SUM(H21:H50),0)","v":{"v":3.820921052631579,"d":"$3.82"}},null,"SUM(G21:G50)",null,"Fish",{"$f":"IF(MAX(T21:T50)>0,\"YES\",\"\")","v":""}]
["Station",null,"Grill",null,"Other Costs (packaging etc.)",{"$nulls":3},"IFERROR(SUM($G$14:$G$17),0)",null,"Shellfish",{"$f":"IF(MAX(U21:U50)>0,\"YES\",\"\")","v":""}]
["Batch Yield (portions)",null,1,null,"Total Batch Cost",null,{"$f":"G4+G5","v":{"v":3.820921052631579,"d":"$3.82"}},{"$nulls":3},"Molluscs",{"$f":"IF(MAX(V21:V50)>0,\"YES\",\"\")","v":""}]
["Portion Size",null,"1 burger + fries",null,"Cost / Portion",null,{"$f":"IFERROR(G6/$C$6,0)","v":{"v":3.820921052631579,"d":"$3.82"}},{"$nulls":3},"Peanuts",{"$f":"IF(MAX(W21:W50)>0,\"YES\",\"\")","v":""}]
["Selling Price / Portion",null,{"v":16,"d":"$16.00"},null,"Food Cost %",null,{"$f":"IFERROR(G7/$C$8,0)","v":{"v":0.23880756578947368,"d":"23.9%"}},{"$nulls":3},"Tree Nuts",{"$f":"IF(MAX(X21:X50)>0,\"YES\",\"\")","v":""}]
["Target Food Cost %",null,{"v":0.3,"d":"30.0%"},null,"Gross Profit / Portion",null,{"$f":"IFERROR($C$8-G7,0)","v":{"v":12.17907894736842,"d":"$12.18"}},{"$nulls":3},"Wheat/Gluten",{"$f":"IF(MAX(Y21:Y50)>0,\"YES\",\"\")","v":"YES"}]
["Prep Time (min)",null,10,null,"Gross Margin %",null,{"$f":"IFERROR(1-G8,0)","v":{"v":0.7611924342105263,"d":"76.1%"}},{"$nulls":3},"Soy",{"$f":"IF(MAX(Z21:Z50)>0,\"YES\",\"\")","v":"YES"}]
["Cook Time (min)",null,8,{"$nulls":7},"Sesame",{"$f":"IF(MAX(AA21:AA50)>0,\"YES\",\"\")","v":"YES"}]
["Shelf Life / Storage",null,"Hold cold 2 days; cook to order",null,"OTHER COSTS (not part of cost of sale in hotels and resorts)",{"$nulls":5},"Mustard",{"$f":"IF(MAX(AB21:AB50)>0,\"YES\",\"\")","v":""}]
[{"$nulls":4},"Description",null,"Cost",null,"Notes",null,"Celery",{"$f":"IF(MAX(AC21:AC50)>0,\"YES\",\"\")","v":""}]
[{"$nulls":4},"Packaging",null,{"v":0.25,"d":"$0.25"},{"$nulls":3},"Lupin",{"$f":"IF(MAX(AD21:AD50)>0,\"YES\",\"\")","v":""}]
[{"$nulls":4},"Napkin/condiment cup",null,{"v":0.1,"d":"$0.10"},{"$nulls":3},"Sulphites",{"$f":"IF(MAX(AE21:AE50)>0,\"YES\",\"\")","v":""}]
[{"$nulls":6},{"v":0,"d":"$0.00"}]
[{"$nulls":6},{"v":0,"d":"$0.00"}]
[]
["INGREDIENTS (enter Qty + Unit; costs auto-calc)",{"$nulls":4},"Actual Qty","Unit Cost",{"$nulls":3},"PREPARATION METHOD"]
["Line","Ingredient","Qty","Unit","Yield %","in base units","(per base)","Line Cost","Notes",null,"Step-by-step method - \n\ncritical control points - \n\nholding temps - \n\nplating - \n\ncross-contamination notes - "]
[1,"Beef mince",{"v":180,"d":"180.00"},"g",{"v":0.9,"d":"90%"},{"$f":"IF($B21=\"\",\"\",IF(ISNUMBER($Q21),$C21*$Q21/E21,\"\"))","v":{"v":200,"d":"200.00"}},{"$f":"IF($B21=\"\",\"\",IFERROR(INDEX(Ingredients_DB!$K$2:$K$501, MATCH($B21, Ingredients_DB!$B$2:$B$501,0)),0))","v":{"v":0.009,"d":"$0.01"}},{"$f":"IF($B21=\"\",\"\",IF(ISNUMBER($F21),$F21*$G21,\"\"))","v":{"v":1.7999999999999998,"d":"$1.80"}},"Patty 180g",{"$nulls":5},{"$f":"IF($B21=\"\",\"\",IFERROR(INDEX(Ingredients_DB!$H$2:$H$501, MATCH($B21, Ingredients_DB!$B$2:$B$501,0)),\"\"))","v":"Weight"},{"$f":"IF($B21=\"\",\"\",IFERROR(INDEX(Ingredients_DB!$I$2:$I$501, MATCH($B21, Ingredients_DB!$B$2:$B$501,0)),\"\"))","v":"g"},{"$f":"IF($B21=\"\",\"\",IFERROR(VLOOKUP($O21&\"|\"&$D21,UOM_Conversions!$A$2:$E$50,4,FALSE),\"CHECK UNIT\"))","v":1},{"$f":"IF($B21=\"\",\"\",IFERROR(INDEX(Ingredients_DB!$M$2:$M$501, MATCH($B21, Ingredients_DB!$B$2:$B$501,0)),0))","v":0},{"$f":"IF($B21=\"\",\"\",IFERROR(INDEX(Ingredients_DB!$N$2:$N$501, MATCH($B21, Ingredients_DB!$B$2:$B$501,0)),0))","v":0},{"$f":"IF($B21=\"\",\"\",IFERROR(INDEX(Ingredients_DB!$O$2:$O$501, MATCH($B21, Ingredients_DB!$B$2:$B$501,0)),0))","v":0},{"$f":"IF($B21=\"\",\"\",IFERROR(INDEX(Ingredients_DB!$P$2:$P$501, MATCH($B21, Ingredients_DB!$B$2:$B$501,0)),0))","v":0},{"$f":"IF($B21=\"\",\"\",IFERROR(INDEX(Ingredients_DB!$Q$2:$Q$501, MATCH($B21, Ingredients_DB!$B$2:$B$501,0)),0))","v":0},{"$f":"IF($B21=\"\",\"\",IFERROR(INDEX(Ingredients_DB!$R$2:$R$501, MATCH($B21, Ingredients_DB!$B$2:$B$501,0)),0))","v":0},{"$f":"IF($B21=\"\",\"\",IFERROR(INDEX(Ingredients_DB!$S$2:$S$501, MATCH($B21, Ingredients_DB!$B$2:$B$501,0)),0))","v":0},{"$f":"IF($B21=\"\",\"\",IFERROR(INDEX(Ingredients_DB!$T$2:$T$501, MATCH($B21, Ingredients_DB!$B$2:$B$501,0)),0))","v":0},{"$f":"IF($B21=\"\",\"\",IFERROR(INDEX(Ingredients_DB!$U$2:$U$501, MATCH($B21, Ingredients_DB!$B$2:$B$501,0)),0))","v":0},{"$f":"IF($B21=\"\",\"\",IFERROR(INDEX(Ingredients_DB!$V$2:$V$501, MATCH($B21, Ingredients_DB!$B$2:$B$501,0)),0))","v":0},{"$f":"IF($B21=\"\",\"\",IFERROR(INDEX(Ingredients_DB!$W$2:$W$501, MATCH($B21, Ingredients_DB!$B$2:$B$501,0)),0))","v":0},{"$f":"IF($B21=\"\",\"\",IFERROR(INDEX(Ingredients_DB!$X$2:$X$501, MATCH($B21, Ingredients_DB!$B$2:$B$501,0)),0))","v":0},{"$f":"IF($B21=\"\",\"\",IFERROR(INDEX(Ingredients_DB!$Y$2:$Y$501, MATCH($B21, Ingredients_DB!$B$2:$B$501,0)),0))","v":0},{"$f":"IF($B21=\"\",\"\",IFERROR(INDEX(Ingredients_DB!$Z$2:$Z$501, MATCH($B21, Ingredients_DB!$B$2:$B$501,0)),0))","v":0}]
[2,"Burger bun",{"v":1,"d":"1.00"},"each",{"v":1,"d":"100%"},{"v":1,"d":"1.00"},{"$f":"IF($B22=\"\",\"\",IFERROR(INDEX(Ingredients_DB!$K$2:$K$501, MATCH($B22, Ingredients_DB!$B$2:$B$501,0)),0))","v":{"v":0.75,"d":"$0.75"}},{"v":0.75,"d":"$0.75"},"Toasted",{"$nulls":5},{"$f":"IF($B22=\"\",\"\",IFERROR(INDEX(Ingredients_DB!$H$2:$H$501, MATCH($B22, Ingredients_DB!$B$2:$B$501,0)),\"\"))","v":"Each"},{"$f":"IF($B22=\"\",\"\",IFERROR(INDEX(Ingredients_DB!$I$2:$I$501, MATCH($B22, Ingredients_DB!$B$2:$B$501,0)),\"\"))","v":"each"},{"$f":"IF($B22=\"\",\"\",IFERROR(VLOOKUP($O22&\"|\"&$D22,UOM_Conversions!$A$2:$E$50,4,FALSE),\"CHECK UNIT\"))","v":1},{"$f":"IF($B22=\"\",\"\",IFERROR(INDEX(Ingredients_DB!$M$2:$M$501, MATCH($B22, Ingredients_DB!$B$2:$B$501,0)),0))","v":0},{"$f":"IF($B22=\"\",\"\",IFERROR(INDEX(Ingredients_DB!$N$2:$N$501, MATCH($B22, Ingredients_DB!$B$2:$B$501,0)),0))","v":0},{"$f":"IF($B22=\"\",\"\",IFERROR(INDEX(Ingredients_DB!$O$2:$O$501, MATCH($B22, Ingredients_DB!$B$2:$B$501,0)),0))","v":0},{"$f":"IF($B22=\"\",\"\",IFERROR(INDEX(Ingredients_DB!$P$2:$P$501, MATCH($B22, Ingredients_DB!$B$2:$B$501,0)),0))","v":0},{"$f":"IF($B22=\"\",\"\",IFERROR(INDEX(Ingredients_DB!$Q$2:$Q$501, MATCH($B22, Ingredients_DB!$B$2:$B$501,0)),0))","v":0},{"$f":"IF($B22=\"\",\"\",IFERROR(INDEX(Ingredients_DB!$R$2:$R$501, MATCH($B22, Ingredients_DB!$B$2:$B$501,0)),0))","v":0},{"$f":"IF($B22=\"\",\"\",IFERROR(INDEX(Ingredients_DB!$S$2:$S$501, MATCH($B22, Ingredients_DB!$B$2:$B$501,0)),0))","v":0},{"$f":"IF($B22=\"\",\"\",IFERROR(INDEX(Ingredients_DB!$T$2:$T$501, MATCH($B22, Ingredients_DB!$B$2:$B$501,0)),0))","v":1},{"$f":"IF($B22=\"\",\"\",IFERROR(INDEX(Ingredients_DB!$U$2:$U$501, MATCH($B22, Ingredients_DB!$B$2:$B$501,0)),0))","v":0},{"$f":"IF($B22=\"\",\"\",IFERROR(INDEX(Ingredients_DB!$V$2:$V$501, MATCH($B22, Ingredients_DB!$B$2:$B$501,0)),0))","v":0},{"$f":"IF($B22=\"\",\"\",IFERROR(INDEX(Ingredients_DB!$W$2:$W$501, MATCH($B22, Ingredients_DB!$B$2:$B$501,0)),0))","v":0},{"$f":"IF($B22=\"\",\"\",IFERROR(INDEX(Ingredients_DB!$X$2:$X$501, MATCH($B22, Ingredients_DB!$B$2:$B$501,0)),0))","v":0},{"$f":"IF($B22=\"\",\"\",IFERROR(INDEX(Ingredients_DB!$Y$2:$Y$501, MATCH($B22, Ingredients_DB!$B$2:$B$501,0)),0))","v":0},{"$f":"IF($B22=\"\",\"\",IFERROR(INDEX(Ingredients_DB!$Z$2:$Z$501, MATCH($B22, Ingredients_DB!$B$2:$B$501,0)),0))","v":0}]
[3,"Cheddar cheese",{"v":30,"d":"30.00"},"g",{"v":1,"d":"100%"},{"v":30,"d":"30.00"},{"$f":"IF($B23=\"\",\"\",IFERROR(INDEX(Ingredients_DB!$K$2:$K$501, MATCH($B23, Ingredients_DB!$B$2:$B$501,0)),0))","v":{"v":0.011,"d":"$0.01"}},{"v":0.32999999999999996,"d":"$0.33"},"Slice",{"$nulls":5},{"$f":"IF($B23=\"\",\"\",IFERROR(INDEX(Ingredients_DB!$H$2:$H$501, MATCH($B23, Ingredients_DB!$B$2:$B$501,0)),\"\"))","v":"Weight"},{"$f":"IF($B23=\"\",\"\",IFERROR(INDEX(Ingredients_DB!$I$2:$I$501, MATCH($B23, Ingredients_DB!$B$2:$B$501,0)),\"\"))","v":"g"},{"$f":"IF($B23=\"\",\"\",IFERROR(VLOOKUP($O23&\"|\"&$D23,UOM_Conversions!$A$2:$E$50,4,FALSE),\"CHECK UNIT\"))","v":1},{"$f":"IF($B23=\"\",\"\",IFERROR(INDEX(Ingredients_DB!$M$2:$M$501, MATCH($B23, Ingredients_DB!$B$2:$B$501,0)),0))","v":1},{"$f":"IF($B23=\"\",\"\",IFERROR(INDEX(Ingredients_DB!$N$2:$N$501, MATCH($B23, Ingredients_DB!$B$2:$B$501,0)),0))","v":0},{"$f":"IF($B23=\"\",\"\",IFERROR(INDEX(Ingredients_DB!$O$2:$O$501, MATCH($B23, Ingredients_DB!$B$2:$B$501,0)),0))","v":0},{"$f":"IF($B23=\"\",\"\",IFERROR(INDEX(Ingredients_DB!$P$2:$P$501, MATCH($B23, Ingredients_DB!$B$2:$B$501,0)),0))","v":0},{"$f":"IF($B23=\"\",\"\",IFERROR(INDEX(Ingredients_DB!$Q$2:$Q$501, MATCH($B23, Ingredients_DB!$B$2:$B$501,0)),0))","v":0},{"$f":"IF($B23=\"\",\"\",IFERROR(INDEX(Ingredients_DB!$R$2:$R$501, MATCH($B23, Ingredients_DB!$B$2:$B$501,0)),0))","v":0},{"$f":"IF($B23=\"\",\"\",IFERROR(INDEX(Ingredients_DB!$S$2:$S$501, MATCH($B23, Ingredients_DB!$B$2:$B$501,0)),0))","v":0},{"$f":"IF($B23=\"\",\"\",IFERROR(INDEX(Ingredients_DB!$T$2:$T$501, MATCH($B23, Ingredients_DB!$B$2:$B$501,0)),0))","v":0},{"$f":"IF($B23=\"\",\"\",IFERROR(INDEX(Ingredients_DB!$U$2:$U$501, MATCH($B23, Ingredients_DB!$B$2:$B$501,0)),0))","v":0},{"$f":"IF($B23=\"\",\"\",IFERROR(INDEX(Ingredients_DB!$V$2:$V$501, MATCH($B23, Ingredients_DB!$B$2:$B$501,0)),0))","v":0},{"$f":"IF($B23=\"\",\"\",IFERROR(INDEX(Ingredients_DB!$W$2:$W$501, MATCH($B23, Ingredients_DB!$B$2:$B$501,0)),0))","v":0},{"$f":"IF($B23=\"\",\"\",IFERROR(INDEX(Ingredients_DB!$X$2:$X$501, MATCH($B23, Ingredients_DB!$B$2:$B$501,0)),0))","v":0},{"$f":"IF($B23=\"\",\"\",IFERROR(INDEX(Ingredients_DB!$Y$2:$Y$501, MATCH($B23, Ingredients_DB!$B$2:$B$501,0)),0))","v":0},{"$f":"IF($B23=\"\",\"\",IFERROR(INDEX(Ingredients_DB!$Z$2:$Z$501, MATCH($B23, Ingredients_DB!$B$2:$B$501,0)),0))","v":0}]
[4,"Lettuce",{"v":20,"d":"20.00"},"g",{"v":0.95,"d":"95%"},{"v":21.05263157894737,"d":"21.05"},{"$f":"IF($B24=\"\",\"\",IFERROR(INDEX(Ingredients_DB!$K$2:$K$501, MATCH($B24, Ingredients_DB!$B$2:$B$501,0)),0))","v":{"v":0.008,"d":"$0.01"}},{"v":0.16842105263157897,"d":"$0.17"},"Shredded",{"$nulls":5},{"$f":"IF($B24=\"\",\"\",IFERROR(INDEX(Ingredients_DB!$H$2:$H$501, MATCH($B24, Ingredients_DB!$B$2:$B$501,0)),\"\"))","v":"Weight"},{"$f":"IF($B24=\"\",\"\",IFERROR(INDEX(Ingredients_DB!$I$2:$I$501, MATCH($B24, Ingredients_DB!$B$2:$B$501,0)),\"\"))","v":"g"},{"$f":"IF($B24=\"\",\"\",IFERROR(VLOOKUP($O24&\"|\"&$D24,UOM_Conversions!$A$2:$E$50,4,FALSE),\"CHECK UNIT\"))","v":1},{"$f":"IF($B24=\"\",\"\",IFERROR(INDEX(Ingredients_DB!$M$2:$M$501, MATCH($B24, Ingredients_DB!$B$2:$B$501,0)),0))","v":0},{"$f":"IF($B24=\"\",\"\",IFERROR(INDEX(Ingredients_DB!$N$2:$N$501, MATCH($B24, Ingredients_DB!$B$2:$B$501,0)),0))","v":0},{"$f":"IF($B24=\"\",\"\",IFERROR(INDEX(Ingredients_DB!$O$2:$O$501, MATCH($B24, Ingredients_DB!$B$2:$B$501,0)),0))","v":0},{"$f":"IF($B24=\"\",\"\",IFERROR(INDEX(Ingredients_DB!$P$2:$P$501, MATCH($B24, Ingredients_DB!$B$2:$B$501,0)),0))","v":0},{"$f":"IF($B24=\"\",\"\",IFERROR(INDEX(Ingredients_DB!$Q$2:$Q$501, MATCH($B24, Ingredients_DB!$B$2:$B$501,0)),0))","v":0},{"$f":"IF($B24=\"\",\"\",IFERROR(INDEX(Ingredients_DB!$R$2:$R$501, MATCH($B24, Ingredients_DB!$B$2:$B$501,0)),0))","v":0},{"$f":"IF($B24=\"\",\"\",IFERROR(INDEX(Ingredients_DB!$S$2:$S$501, MATCH($B24, Ingredients_DB!$B$2:$B$501,0)),0))","v":0},{"$f":"IF($B24=\"\",\"\",IFERROR(INDEX(Ingredients_DB!$T$2:$T$501, MATCH($B24, Ingredients_DB!$B$2:$B$501,0)),0))","v":0},{"$f":"IF($B24=\"\",\"\",IFERROR(INDEX(Ingredients_DB!$U$2:$U$501, MATCH($B24, Ingredients_DB!$B$2:$B$501,0)),0))","v":0},{"$f":"IF($B24=\"\",\"\",IFERROR(INDEX(Ingredients_DB!$V$2:$V$501, MATCH($B24, Ingredients_DB!$B$2:$B$501,0)),0))","v":0},{"$f":"IF($B24=\"\",\"\",IFERROR(INDEX(Ingredients_DB!$W$2:$W$501, MATCH($B24, Ingredients_DB!$B$2:$B$501,0)),0))","v":0},{"$f":"IF($B24=\"\",\"\",IFERROR(INDEX(Ingredients_DB!$X$2:$X$501, MATCH($B24, Ingredients_DB!$B$2:$B$501,0)),0))","v":0},{"$f":"IF($B24=\"\",\"\",IFERROR(INDEX(Ingredients_DB!$Y$2:$Y$501, MATCH($B24, Ingredients_DB!$B$2:$B$501,0)),0))","v":0},{"$f":"IF($B24=\"\",\"\",IFERROR(INDEX(Ingredients_DB!$Z$2:$Z$501, MATCH($B24, Ingredients_DB!$B$2:$B$501,0)),0))","v":0}]
[5,"Ketchup",{"v":20,"d":"20.00"},"g",{"v":1,"d":"100%"},{"v":20,"d":"20.00"},{"$f":"IF($B25=\"\",\"\",IFERROR(INDEX(Ingredients_DB!$K$2:$K$501, MATCH($B25, Ingredients_DB!$B$2:$B$501,0)),0))","v":{"v":0.004,"d":"$0.00"}},{"v":0.08,"d":"$0.08"},{"$nulls":6},{"$f":"IF($B25=\"\",\"\",IFERROR(INDEX(Ingredients_DB!$H$2:$H$501, MATCH($B25, Ingredients_DB!$B$2:$B$501,0)),\"\"))","v":"Weight"},{"$f":"IF($B25=\"\",\"\",IFERROR(INDEX(Ingredients_DB!$I$2:$I$501, MATCH($B25, Ingredients_DB!$B$2:$B$501,0)),\"\"))","v":"g"},{"$f":"IF($B25=\"\",\"\",IFERROR(VLOOKUP($O25&\"|\"&$D25,UOM_Conversions!$A$2:$E$50,4,FALSE),\"CHECK UNIT\"))","v":1},{"$f":"IF($B25=\"\",\"\",IFERROR(INDEX(Ingredients_DB!$M$2:$M$501, MATCH($B25, Ingredients_DB!$B$2:$B$501,0)),0))","v":0},{"$f":"IF($B25=\"\",\"\",IFERROR(INDEX(Ingredients_DB!$N$2:$N$501, MATCH($B25, Ingredients_DB!$B$2:$B$501,0)),0))","v":0},{"$f":"IF($B25=\"\",\"\",IFERROR(INDEX(Ingredients_DB!$O$2:$O$501, MATCH($B25, Ingredients_DB!$B$2:$B$501,0)),0))","v":0},{"$f":"IF($B25=\"\",\"\",IFERROR(INDEX(Ingredients_DB!$P$2:$P$501, MATCH($B25, Ingredients_DB!$B$2:$B$501,0)),0))","v":0},{"$f":"IF($B25=\"\",\"\",IFERROR(INDEX(Ingredients_DB!$Q$2:$Q$501, MATCH($B25, Ingredients_DB!$B$2:$B$501,0)),0))","v":0},{"$f":"IF($B25=\"\",\"\",IFERROR(INDEX(Ingredients_DB!$R$2:$R$501, MATCH($B25, Ingredients_DB!$B$2:$B$501,0)),0))","v":0},{"$f":"IF($B25=\"\",\"\",IFERROR(INDEX(Ingredients_DB!$S$2:$S$501, MATCH($B25, Ingredients_DB!$B$2:$B$501,0)),0))","v":0},{"$f":"IF($B25=\"\",\"\",IFERROR(INDEX(Ingredients_DB!$T$2:$T$501, MATCH($B25, Ingredients_DB!$B$2:$B$501,0)),0))","v":0},{"$f":"IF($B25=\"\",\"\",IFERROR(INDEX(Ingredients_DB!$U$2:$U$501, MATCH($B25, Ingredients_DB!$B$2:$B$501,0)),0))","v":0},{"$f":"IF($B25=\"\",\"\",IFERROR(INDEX(Ingredients_DB!$V$2:$V$501, MATCH($B25, Ingredients_DB!$B$2:$B$501,0)),0))","v":0},{"$f":"IF($B25=\"\",\"\",IFERROR(INDEX(Ingredients_DB!$W$2:$W$501, MATCH($B25, Ingredients_DB!$B$2:$B$501,0)),0))","v":0},{"$f":"IF($B25=\"\",\"\",IFERROR(INDEX(Ingredients_DB!$X$2:$X$501, MATCH($B25, Ingredients_DB!$B$2:$B$501,0)),0))","v":0},{"$f":"IF($B25=\"\",\"\",IFERROR(INDEX(Ingredients_DB!$Y$2:$Y$501, MATCH($B25, Ingredients_DB!$B$2:$B$501,0)),0))","v":0},{"$f":"IF($B25=\"\",\"\",IFERROR(INDEX(Ingredients_DB!$Z$2:$Z$501, MATCH($B25, Ingredients_DB!$B$2:$B$501,0)),0))","v":0}]
[6,"Mayonnaise",{"v":15,"d":"15.00"},"g",{"v":1,"d":"100%"},{"v":15,"d":"15.00"},{"$f":"IF($B26=\"\",\"\",IFERROR(INDEX(Ingredients_DB!$K$2:$K$501, MATCH($B26, Ingredients_DB!$B$2:$B$501,0)),0))","v":{"v":0.0075,"d":"$0.01"}},{"v":0.11249999999999999,"d":"$0.11"},{"$nulls":6},{"$f":"IF($B26=\"\",\"\",IFERROR(INDEX(Ingredients_DB!$H$2:$H$501, MATCH($B26, Ingredients_DB!$B$2:$B$501,0)),\"\"))","v":"Weight"},{"$f":"IF($B26=\"\",\"\",IFERROR(INDEX(Ingredients_DB!$I$2:$I$501, MATCH($B26, Ingredients_DB!$B$2:$B$501,0)),\"\"))","v":"g"},{"$f":"IF($B26=\"\",\"\",IFERROR(VLOOKUP($O26&\"|\"&$D26,UOM_Conversions!$A$2:$E$50,4,FALSE),\"CHECK UNIT\"))","v":1},{"$f":"IF($B26=\"\",\"\",IFERROR(INDEX(Ingredients_DB!$M$2:$M$501, MATCH($B26, Ingredients_DB!$B$2:$B$501,0)),0))","v":0},{"$f":"IF($B26=\"\",\"\",IFERROR(INDEX(Ingredients_DB!$N$2:$N$501, MATCH($B26, Ingredients_DB!$B$2:$B$501,0)),0))","v":1},{"$f":"IF($B26=\"\",\"\",IFERROR(INDEX(Ingredients_DB!$O$2:$O$501, MATCH($B26, Ingredients_DB!$B$2:$B$501,0)),0))","v":0},{"$f":"IF($B26=\"\",\"\",IFERROR(INDEX(Ingredients_DB!$P$2:$P$501, MATCH($B26, Ingredients_DB!$B$2:$B$501,0)),0))","v":0},{"$f":"IF($B26=\"\",\"\",IFERROR(INDEX(Ingredients_DB!$Q$2:$Q$501, MATCH($B26, Ingredients_DB!$B$2:$B$501,0)),0))","v":0},{"$f":"IF($B26=\"\",\"\",IFERROR(INDEX(Ingredients_DB!$R$2:$R$501, MATCH($B26, Ingredients_DB!$B$2:$B$501,0)),0))","v":0},{"$f":"IF($B26=\"\",\"\",IFERROR(INDEX(Ingredients_DB!$S$2:$S$501, MATCH($B26, Ingredients_DB!$B$2:$B$501,0)),0))","v":0},{"$f":"IF($B26=\"\",\"\",IFERROR(INDEX(Ingredients_DB!$T$2:$T$501, MATCH($B26, Ingredients_DB!$B$2:$B$501,0)),0))","v":0},{"$f":"IF($B26=\"\",\"\",IFERROR(INDEX(Ingredients_DB!$U$2:$U$501, MATCH($B26, Ingredients_DB!$B$2:$B$501,0)),0))","v":1},{"$f":"IF($B26=\"\",\"\",IFERROR(INDEX(Ingredients_DB!$V$2:$V$501, MATCH($B26, Ingredients_DB!$B$2:$B$501,0)),0))","v":0},{"$f":"IF($B26=\"\",\"\",IFERROR(INDEX(Ingredients_DB!$W$2:$W$501, MATCH($B26, Ingredients_DB!$B$2:$B$501,0)),0))","v":0},{"$f":"IF($B26=\"\",\"\",IFERROR(INDEX(Ingredients_DB!$X$2:$X$501, MATCH($B26, Ingredients_DB!$B$2:$B$501,0)),0))","v":0},{"$f":"IF($B26=\"\",\"\",IFERROR(INDEX(Ingredients_DB!$Y$2:$Y$501, MATCH($B26, Ingredients_DB!$B$2:$B$501,0)),0))","v":0},{"$f":"IF($B26=\"\",\"\",IFERROR(INDEX(Ingredients_DB!$Z$2:$Z$501, MATCH($B26, Ingredients_DB!$B$2:$B$501,0)),0))","v":0}]
[7,"French fries (frozen)",{"v":200,"d":"200.00"},"g",{"v":1,"d":"100%"},{"v":200,"d":"200.00"},{"$f":"IF($B27=\"\",\"\",IFERROR(INDEX(Ingredients_DB!$K$2:$K$501, MATCH($B27, Ingredients_DB!$B$2:$B$501,0)),0))","v":{"v":2.8E-3,"d":"$0.00"}},{"v":0.5599999999999999,"d":"$0.56"},"Portion",{"$nulls":5},{"$f":"IF($B27=\"\",\"\",IFERROR(INDEX(Ingredients_DB!$H$2:$H$501, MATCH($B27, Ingredients_DB!$B$2:$B$501,0)),\"\"))","v":"Weight"},{"$f":"IF($B27=\"\",\"\",IFERROR(INDEX(Ingredients_DB!$I$2:$I$501, MATCH($B27, Ingredients_DB!$B$2:$B$501,0)),\"\"))","v":"g"},{"$f":"IF($B27=\"\",\"\",IFERROR(VLOOKUP($O27&\"|\"&$D27,UOM_Conversions!$A$2:$E$50,4,FALSE),\"CHECK UNIT\"))","v":1},{"$f":"IF($B27=\"\",\"\",IFERROR(INDEX(Ingredients_DB!$M$2:$M$501, MATCH($B27, Ingredients_DB!$B$2:$B$501,0)),0))","v":0},{"$f":"IF($B27=\"\",\"\",IFERROR(INDEX(Ingredients_DB!$N$2:$N$501, MATCH($B27, Ingredients_DB!$B$2:$B$501,0)),0))","v":0},{"$f":"IF($B27=\"\",\"\",IFERROR(INDEX(Ingredients_DB!$O$2:$O$501, MATCH($B27, Ingredients_DB!$B$2:$B$501,0)),0))","v":0},{"$f":"IF($B27=\"\",\"\",IFERROR(INDEX(Ingredients_DB!$P$2:$P$501, MATCH($B27, Ingredients_DB!$B$2:$B$501,0)),0))","v":0},{"$f":"IF($B27=\"\",\"\",IFERROR(INDEX(Ingredients_DB!$Q$2:$Q$501, MATCH($B27, Ingredients_DB!$B$2:$B$501,0)),0))","v":0},{"$f":"IF($B27=\"\",\"\",IFERROR(INDEX(Ingredients_DB!$R$2:$R$501, MATCH($B27, Ingredients_DB!$B$2:$B$501,0)),0))","v":0},{"$f":"IF($B27=\"\",\"\",IFERROR(INDEX(Ingredients_DB!$S$2:$S$501, MATCH($B27, Ingredients_DB!$B$2:$B$501,0)),0))","v":0},{"$f":"IF($B27=\"\",\"\",IFERROR(INDEX(Ingredients_DB!$T$2:$T$501, MATCH($B27, Ingredients_DB!$B$2:$B$501,0)),0))","v":0},{"$f":"IF($B27=\"\",\"\",IFERROR(INDEX(Ingredients_DB!$U$2:$U$501, MATCH($B27, Ingredients_DB!$B$2:$B$501,0)),0))","v":0},{"$f":"IF($B27=\"\",\"\",IFERROR(INDEX(Ingredients_DB!$V$2:$V$501, MATCH($B27, Ingredients_DB!$B$2:$B$501,0)),0))","v":0},{"$f":"IF($B27=\"\",\"\",IFERROR(INDEX(Ingredients_DB!$W$2:$W$501, MATCH($B27, Ingredients_DB!$B$2:$B$501,0)),0))","v":0},{"$f":"IF($B27=\"\",\"\",IFERROR(INDEX(Ingredients_DB!$X$2:$X$501, MATCH($B27, Ingredients_DB!$B$2:$B$501,0)),0))","v":0},{"$f":"IF($B27=\"\",\"\",IFERROR(INDEX(Ingredients_DB!$Y$2:$Y$501, MATCH($B27, Ingredients_DB!$B$2:$B$501,0)),0))","v":0},{"$f":"IF($B27=\"\",\"\",IFERROR(INDEX(Ingredients_DB!$Z$2:$Z$501, MATCH($B27, Ingredients_DB!$B$2:$B$501,0)),0))","v":0}]
[8,"Sesame seeds",{"v":2,"d":"2.00"},"g",{"v":1,"d":"100%"},{"v":2,"d":"2.00"},{"$f":"IF($B28=\"\",\"\",IFERROR(INDEX(Ingredients_DB!$K$2:$K$501, MATCH($B28, Ingredients_DB!$B$2:$B$501,0)),0))","v":{"v":0.01,"d":"$0.01"}},{"v":0.02,"d":"$0.02"},"Bun topping (optional)",{"$nulls":5},{"$f":"IF($B28=\"\",\"\",IFERROR(INDEX(Ingredients_DB!$H$2:$H$501, MATCH($B28, Ingredients_DB!$B$2:$B$501,0)),\"\"))","v":"Weight"},{"$f":"IF($B28=\"\",\"\",IFERROR(INDEX(Ingredients_DB!$I$2:$I$501, MATCH($B28, Ingredients_DB!$B$2:$B$501,0)),\"\"))","v":"g"},{"$f":"IF($B28=\"\",\"\",IFERROR(VLOOKUP($O28&\"|\"&$D28,UOM_Conversions!$A$2:$E$50,4,FALSE),\"CHECK UNIT\"))","v":1},{"$f":"IF($B28=\"\",\"\",IFERROR(INDEX(Ingredients_DB!$M$2:$M$501, MATCH($B28, Ingredients_DB!$B$2:$B$501,0)),0))","v":0},{"$f":"IF($B28=\"\",\"\",IFERROR(INDEX(Ingredients_DB!$N$2:$N$501, MATCH($B28, Ingredients_DB!$B$2:$B$501,0)),0))","v":0},{"$f":"IF($B28=\"\",\"\",IFERROR(INDEX(Ingredients_DB!$O$2:$O$501, MATCH($B28, Ingredients_DB!$B$2:$B$501,0)),0))","v":0},{"$f":"IF($B28=\"\",\"\",IFERROR(INDEX(Ingredients_DB!$P$2:$P$501, MATCH($B28, Ingredients_DB!$B$2:$B$501,0)),0))","v":0},{"$f":"IF($B28=\"\",\"\",IFERROR(INDEX(Ingredients_DB!$Q$2:$Q$501, MATCH($B28, Ingredients_DB!$B$2:$B$501,0)),0))","v":0},{"$f":"IF($B28=\"\",\"\",IFERROR(INDEX(Ingredients_DB!$R$2:$R$501, MATCH($B28, Ingredients_DB!$B$2:$B$501,0)),0))","v":0},{"$f":"IF($B28=\"\",\"\",IFERROR(INDEX(Ingredients_DB!$S$2:$S$501, MATCH($B28, Ingredients_DB!$B$2:$B$501,0)),0))","v":0},{"$f":"IF($B28=\"\",\"\",IFERROR(INDEX(Ingredients_DB!$T$2:$T$501, MATCH($B28, Ingredients_DB!$B$2:$B$501,0)),0))","v":0},{"$f":"IF($B28=\"\",\"\",IFERROR(INDEX(Ingredients_DB!$U$2:$U$501, MATCH($B28, Ingredients_DB!$B$2:$B$501,0)),0))","v":0},{"$f":"IF($B28=\"\",\"\",IFERROR(INDEX(Ingredients_DB!$V$2:$V$501, MATCH($B28, Ingredients_DB!$B$2:$B$501,0)),0))","v":1},{"$f":"IF($B28=\"\",\"\",IFERROR(INDEX(Ingredients_DB!$W$2:$W$501, MATCH($B28, Ingredients_DB!$B$2:$B$501,0)),0))","v":0},{"$f":"IF($B28=\"\",\"\",IFERROR(INDEX(Ingredients_DB!$X$2:$X$501, MATCH($B28, Ingredients_DB!$B$2:$B$501,0)),0))","v":0},{"$f":"IF($B28=\"\",\"\",IFERROR(INDEX(Ingredients_DB!$Y$2:$Y$501, MATCH($B28, Ingredients_DB!$B$2:$B$501,0)),0))","v":0},{"$f":"IF($B28=\"\",\"\",IFERROR(INDEX(Ingredients_DB!$Z$2:$Z$501, MATCH($B28, Ingredients_DB!$B$2:$B$501,0)),0))","v":0}]
[9,null,{"v":0,"d":"0.00"},"g",null,"",{"$f":"IF($B29=\"\",\"\",IFERROR(INDEX(Ingredients_DB!$K$2:$K$501, MATCH($B29, Ingredients_DB!$B$2:$B$501,0)),0))","v":""},"",{"$nulls":6},{"$f":"IF($B29=\"\",\"\",IFERROR(INDEX(Ingredients_DB!$H$2:$H$501, MATCH($B29, Ingredients_DB!$B$2:$B$501,0)),\"\"))","v":""},{"$f":"IF($B29=\"\",\"\",IFERROR(INDEX(Ingredients_DB!$I$2:$I$501, MATCH($B29, Ingredients_DB!$B$2:$B$501,0)),\"\"))","v":""},{"$f":"IF($B29=\"\",\"\",IFERROR(VLOOKUP($O29&\"|\"&$D29,UOM_Conversions!$A$2:$E$50,4,FALSE),\"CHECK UNIT\"))","v":""},{"$f":"IF($B29=\"\",\"\",IFERROR(INDEX(Ingredients_DB!$M$2:$M$501, MATCH($B29, Ingredients_DB!$B$2:$B$501,0)),0))","v":""},{"$f":"IF($B29=\"\",\"\",IFERROR(INDEX(Ingredients_DB!$N$2:$N$501, MATCH($B29, Ingredients_DB!$B$2:$B$501,0)),0))","v":""},{"$f":"IF($B29=\"\",\"\",IFERROR(INDEX(Ingredients_DB!$O$2:$O$501, MATCH($B29, Ingredients_DB!$B$2:$B$501,0)),0))","v":""},{"$f":"IF($B29=\"\",\"\",IFERROR(INDEX(Ingredients_DB!$P$2:$P$501, MATCH($B29, Ingredients_DB!$B$2:$B$501,0)),0))","v":""},{"$f":"IF($B29=\"\",\"\",IFERROR(INDEX(Ingredients_DB!$Q$2:$Q$501, MATCH($B29, Ingredients_DB!$B$2:$B$501,0)),0))","v":""},{"$f":"IF($B29=\"\",\"\",IFERROR(INDEX(Ingredients_DB!$R$2:$R$501, MATCH($B29, Ingredients_DB!$B$2:$B$501,0)),0))","v":""},{"$f":"IF($B29=\"\",\"\",IFERROR(INDEX(Ingredients_DB!$S$2:$S$501, MATCH($B29, Ingredients_DB!$B$2:$B$501,0)),0))","v":""},{"$f":"IF($B29=\"\",\"\",IFERROR(INDEX(Ingredients_DB!$T$2:$T$501, MATCH($B29, Ingredients_DB!$B$2:$B$501,0)),0))","v":""},{"$f":"IF($B29=\"\",\"\",IFERROR(INDEX(Ingredients_DB!$U$2:$U$501, MATCH($B29, Ingredients_DB!$B$2:$B$501,0)),0))","v":""},{"$f":"IF($B29=\"\",\"\",IFERROR(INDEX(Ingredients_DB!$V$2:$V$501, MATCH($B29, Ingredients_DB!$B$2:$B$501,0)),0))","v":""},{"$f":"IF($B29=\"\",\"\",IFERROR(INDEX(Ingredients_DB!$W$2:$W$501, MATCH($B29, Ingredients_DB!$B$2:$B$501,0)),0))","v":""},{"$f":"IF($B29=\"\",\"\",IFERROR(INDEX(Ingredients_DB!$X$2:$X$501, MATCH($B29, Ingredients_DB!$B$2:$B$501,0)),0))","v":""},{"$f":"IF($B29=\"\",\"\",IFERROR(INDEX(Ingredients_DB!$Y$2:$Y$501, MATCH($B29, Ingredients_DB!$B$2:$B$501,0)),0))","v":""},{"$f":"IF($B29=\"\",\"\",IFERROR(INDEX(Ingredients_DB!$Z$2:$Z$501, MATCH($B29, Ingredients_DB!$B$2:$B$501,0)),0))","v":""}]
[10,null,{"v":0,"d":"0.00"},"g",null,"",{"$f":"IF($B30=\"\",\"\",IFERROR(INDEX(Ingredients_DB!$K$2:$K$501, MATCH($B30, Ingredients_DB!$B$2:$B$501,0)),0))","v":""},"",{"$nulls":6},{"$f":"IF($B30=\"\",\"\",IFERROR(INDEX(Ingredients_DB!$H$2:$H$501, MATCH($B30, Ingredients_DB!$B$2:$B$501,0)),\"\"))","v":""},{"$f":"IF($B30=\"\",\"\",IFERROR(INDEX(Ingredients_DB!$I$2:$I$501, MATCH($B30, Ingredients_DB!$B$2:$B$501,0)),\"\"))","v":""},{"$f":"IF($B30=\"\",\"\",IFERROR(VLOOKUP($O30&\"|\"&$D30,UOM_Conversions!$A$2:$E$50,4,FALSE),\"CHECK UNIT\"))","v":""},{"$f":"IF($B30=\"\",\"\",IFERROR(INDEX(Ingredients_DB!$M$2:$M$501, MATCH($B30, Ingredients_DB!$B$2:$B$501,0)),0))","v":""},{"$f":"IF($B30=\"\",\"\",IFERROR(INDEX(Ingredients_DB!$N$2:$N$501, MATCH($B30, Ingredients_DB!$B$2:$B$501,0)),0))","v":""},{"$f":"IF($B30=\"\",\"\",IFERROR(INDEX(Ingredients_DB!$O$2:$O$501, MATCH($B30, Ingredients_DB!$B$2:$B$501,0)),0))","v":""},{"$f":"IF($B30=\"\",\"\",IFERROR(INDEX(Ingredients_DB!$P$2:$P$501, MATCH($B30, Ingredients_DB!$B$2:$B$501,0)),0))","v":""},{"$f":"IF($B30=\"\",\"\",IFERROR(INDEX(Ingredients_DB!$Q$2:$Q$501, MATCH($B30, Ingredients_DB!$B$2:$B$501,0)),0))","v":""},{"$f":"IF($B30=\"\",\"\",IFERROR(INDEX(Ingredients_DB!$R$2:$R$501, MATCH($B30, Ingredients_DB!$B$2:$B$501,0)),0))","v":""},{"$f":"IF($B30=\"\",\"\",IFERROR(INDEX(Ingredients_DB!$S$2:$S$501, MATCH($B30, Ingredients_DB!$B$2:$B$501,0)),0))","v":""},{"$f":"IF($B30=\"\",\"\",IFERROR(INDEX(Ingredients_DB!$T$2:$T$501, MATCH($B30, Ingredients_DB!$B$2:$B$501,0)),0))","v":""},{"$f":"IF($B30=\"\",\"\",IFERROR(INDEX(Ingredients_DB!$U$2:$U$501, MATCH($B30, Ingredients_DB!$B$2:$B$501,0)),0))","v":""},{"$f":"IF($B30=\"\",\"\",IFERROR(INDEX(Ingredients_DB!$V$2:$V$501, MATCH($B30, Ingredients_DB!$B$2:$B$501,0)),0))","v":""},{"$f":"IF($B30=\"\",\"\",IFERROR(INDEX(Ingredients_DB!$W$2:$W$501, MATCH($B30, Ingredients_DB!$B$2:$B$501,0)),0))","v":""},{"$f":"IF($B30=\"\",\"\",IFERROR(INDEX(Ingredients_DB!$X$2:$X$501, MATCH($B30, Ingredients_DB!$B$2:$B$501,0)),0))","v":""},{"$f":"IF($B30=\"\",\"\",IFERROR(INDEX(Ingredients_DB!$Y$2:$Y$501, MATCH($B30, Ingredients_DB!$B$2:$B$501,0)),0))","v":""},{"$f":"IF($B30=\"\",\"\",IFERROR(INDEX(Ingredients_DB!$Z$2:$Z$501, MATCH($B30, Ingredients_DB!$B$2:$B$501,0)),0))","v":""}]
[11,null,{"v":0,"d":"0.00"},"g",null,"",{"$f":"IF($B31=\"\",\"\",IFERROR(INDEX(Ingredients_DB!$K$2:$K$501, MATCH($B31, Ingredients_DB!$B$2:$B$501,0)),0))","v":""},"",{"$nulls":6},{"$f":"IF($B31=\"\",\"\",IFERROR(INDEX(Ingredients_DB!$H$2:$H$501, MATCH($B31, Ingredients_DB!$B$2:$B$501,0)),\"\"))","v":""},{"$f":"IF($B31=\"\",\"\",IFERROR(INDEX(Ingredients_DB!$I$2:$I$501, MATCH($B31, Ingredients_DB!$B$2:$B$501,0)),\"\"))","v":""},{"$f":"IF($B31=\"\",\"\",IFERROR(VLOOKUP($O31&\"|\"&$D31,UOM_Conversions!$A$2:$E$50,4,FALSE),\"CHECK UNIT\"))","v":""},{"$f":"IF($B31=\"\",\"\",IFERROR(INDEX(Ingredients_DB!$M$2:$M$501, MATCH($B31, Ingredients_DB!$B$2:$B$501,0)),0))","v":""},{"$f":"IF($B31=\"\",\"\",IFERROR(INDEX(Ingredients_DB!$N$2:$N$501, MATCH($B31, Ingredients_DB!$B$2:$B$501,0)),0))","v":""},{"$f":"IF($B31=\"\",\"\",IFERROR(INDEX(Ingredients_DB!$O$2:$O$501, MATCH($B31, Ingredients_DB!$B$2:$B$501,0)),0))","v":""},{"$f":"IF($B31=\"\",\"\",IFERROR(INDEX(Ingredients_DB!$P$2:$P$501, MATCH($B31, Ingredients_DB!$B$2:$B$501,0)),0))","v":""},{"$f":"IF($B31=\"\",\"\",IFERROR(INDEX(Ingredients_DB!$Q$2:$Q$501, MATCH($B31, Ingredients_DB!$B$2:$B$501,0)),0))","v":""},{"$f":"IF($B31=\"\",\"\",IFERROR(INDEX(Ingredients_DB!$R$2:$R$501, MATCH($B31, Ingredients_DB!$B$2:$B$501,0)),0))","v":""},{"$f":"IF($B31=\"\",\"\",IFERROR(INDEX(Ingredients_DB!$S$2:$S$501, MATCH($B31, Ingredients_DB!$B$2:$B$501,0)),0))","v":""},{"$f":"IF($B31=\"\",\"\",IFERROR(INDEX(Ingredients_DB!$T$2:$T$501, MATCH($B31, Ingredients_DB!$B$2:$B$501,0)),0))","v":""},{"$f":"IF($B31=\"\",\"\",IFERROR(INDEX(Ingredients_DB!$U$2:$U$501, MATCH($B31, Ingredients_DB!$B$2:$B$501,0)),0))","v":""},{"$f":"IF($B31=\"\",\"\",IFERROR(INDEX(Ingredients_DB!$V$2:$V$501, MATCH($B31, Ingredients_DB!$B$2:$B$501,0)),0))","v":""},{"$f":"IF($B31=\"\",\"\",IFERROR(INDEX(Ingredients_DB!$W$2:$W$501, MATCH($B31, Ingredients_DB!$B$2:$B$501,0)),0))","v":""},{"$f":"IF($B31=\"\",\"\",IFERROR(INDEX(Ingredients_DB!$X$2:$X$501, MATCH($B31, Ingredients_DB!$B$2:$B$501,0)),0))","v":""},{"$f":"IF($B31=\"\",\"\",IFERROR(INDEX(Ingredients_DB!$Y$2:$Y$501, MATCH($B31, Ingredients_DB!$B$2:$B$501,0)),0))","v":""},{"$f":"IF($B31=\"\",\"\",IFERROR(INDEX(Ingredients_DB!$Z$2:$Z$501, MATCH($B31, Ingredients_DB!$B$2:$B$501,0)),0))","v":""}]
[12,null,{"v":0,"d":"0.00"},"g",null,"",{"$f":"IF($B32=\"\",\"\",IFERROR(INDEX(Ingredients_DB!$K$2:$K$501, MATCH($B32, Ingredients_DB!$B$2:$B$501,0)),0))","v":""},"",{"$nulls":6},{"$f":"IF($B32=\"\",\"\",IFERROR(INDEX(Ingredients_DB!$H$2:$H$501, MATCH($B32, Ingredients_DB!$B$2:$B$501,0)),\"\"))","v":""},{"$f":"IF($B32=\"\",\"\",IFERROR(INDEX(Ingredients_DB!$I$2:$I$501, MATCH($B32, Ingredients_DB!$B$2:$B$501,0)),\"\"))","v":""},{"$f":"IF($B32=\"\",\"\",IFERROR(VLOOKUP($O32&\"|\"&$D32,UOM_Conversions!$A$2:$E$50,4,FALSE),\"CHECK UNIT\"))","v":""},{"$f":"IF($B32=\"\",\"\",IFERROR(INDEX(Ingredients_DB!$M$2:$M$501, MATCH($B32, Ingredients_DB!$B$2:$B$501,0)),0))","v":""},{"$f":"IF($B32=\"\",\"\",IFERROR(INDEX(Ingredients_DB!$N$2:$N$501, MATCH($B32, Ingredients_DB!$B$2:$B$501,0)),0))","v":""},{"$f":"IF($B32=\"\",\"\",IFERROR(INDEX(Ingredients_DB!$O$2:$O$501, MATCH($B32, Ingredients_DB!$B$2:$B$501,0)),0))","v":""},{"$f":"IF($B32=\"\",\"\",IFERROR(INDEX(Ingredients_DB!$P$2:$P$501, MATCH($B32, Ingredients_DB!$B$2:$B$501,0)),0))","v":""},{"$f":"IF($B32=\"\",\"\",IFERROR(INDEX(Ingredients_DB!$Q$2:$Q$501, MATCH($B32, Ingredients_DB!$B$2:$B$501,0)),0))","v":""},{"$f":"IF($B32=\"\",\"\",IFERROR(INDEX(Ingredients_DB!$R$2:$R$501, MATCH($B32, Ingredients_DB!$B$2:$B$501,0)),0))","v":""},{"$f":"IF($B32=\"\",\"\",IFERROR(INDEX(Ingredients_DB!$S$2:$S$501, MATCH($B32, Ingredients_DB!$B$2:$B$501,0)),0))","v":""},{"$f":"IF($B32=\"\",\"\",IFERROR(INDEX(Ingredients_DB!$T$2:$T$501, MATCH($B32, Ingredients_DB!$B$2:$B$501,0)),0))","v":""},{"$f":"IF($B32=\"\",\"\",IFERROR(INDEX(Ingredients_DB!$U$2:$U$501, MATCH($B32, Ingredients_DB!$B$2:$B$501,0)),0))","v":""},{"$f":"IF($B32=\"\",\"\",IFERROR(INDEX(Ingredients_DB!$V$2:$V$501, MATCH($B32, Ingredients_DB!$B$2:$B$501,0)),0))","v":""},{"$f":"IF($B32=\"\",\"\",IFERROR(INDEX(Ingredients_DB!$W$2:$W$501, MATCH($B32, Ingredients_DB!$B$2:$B$501,0)),0))","v":""},{"$f":"IF($B32=\"\",\"\",IFERROR(INDEX(Ingredients_DB!$X$2:$X$501, MATCH($B32, Ingredients_DB!$B$2:$B$501,0)),0))","v":""},{"$f":"IF($B32=\"\",\"\",IFERROR(INDEX(Ingredients_DB!$Y$2:$Y$501, MATCH($B32, Ingredients_DB!$B$2:$B$501,0)),0))","v":""},{"$f":"IF($B32=\"\",\"\",IFERROR(INDEX(Ingredients_DB!$Z$2:$Z$501, MATCH($B32, Ingredients_DB!$B$2:$B$501,0)),0))","v":""}]
[13,null,{"v":0,"d":"0.00"},"g",null,"",{"$f":"IF($B33=\"\",\"\",IFERROR(INDEX(Ingredients_DB!$K$2:$K$501, MATCH($B33, Ingredients_DB!$B$2:$B$501,0)),0))","v":""},"",{"$nulls":6},{"$f":"IF($B33=\"\",\"\",IFERROR(INDEX(Ingredients_DB!$H$2:$H$501, MATCH($B33, Ingredients_DB!$B$2:$B$501,0)),\"\"))","v":""},{"$f":"IF($B33=\"\",\"\",IFERROR(INDEX(Ingredients_DB!$I$2:$I$501, MATCH($B33, Ingredients_DB!$B$2:$B$501,0)),\"\"))","v":""},{"$f":"IF($B33=\"\",\"\",IFERROR(VLOOKUP($O33&\"|\"&$D33,UOM_Conversions!$A$2:$E$50,4,FALSE),\"CHECK UNIT\"))","v":""},{"$f":"IF($B33=\"\",\"\",IFERROR(INDEX(Ingredients_DB!$M$2:$M$501, MATCH($B33, Ingredients_DB!$B$2:$B$501,0)),0))","v":""},{"$f":"IF($B33=\"\",\"\",IFERROR(INDEX(Ingredients_DB!$N$2:$N$501, MATCH($B33, Ingredients_DB!$B$2:$B$501,0)),0))","v":""},{"$f":"IF($B33=\"\",\"\",IFERROR(INDEX(Ingredients_DB!$O$2:$O$501, MATCH($B33, Ingredients_DB!$B$2:$B$501,0)),0))","v":""},{"$f":"IF($B33=\"\",\"\",IFERROR(INDEX(Ingredients_DB!$P$2:$P$501, MATCH($B33, Ingredients_DB!$B$2:$B$501,0)),0))","v":""},{"$f":"IF($B33=\"\",\"\",IFERROR(INDEX(Ingredients_DB!$Q$2:$Q$501, MATCH($B33, Ingredients_DB!$B$2:$B$501,0)),0))","v":""},{"$f":"IF($B33=\"\",\"\",IFERROR(INDEX(Ingredients_DB!$R$2:$R$501, MATCH($B33, Ingredients_DB!$B$2:$B$501,0)),0))","v":""},{"$f":"IF($B33=\"\",\"\",IFERROR(INDEX(Ingredients_DB!$S$2:$S$501, MATCH($B33, Ingredients_DB!$B$2:$B$501,0)),0))","v":""},{"$f":"IF($B33=\"\",\"\",IFERROR(INDEX(Ingredients_DB!$T$2:$T$501, MATCH($B33, Ingredients_DB!$B$2:$B$501,0)),0))","v":""},{"$f":"IF($B33=\"\",\"\",IFERROR(INDEX(Ingredients_DB!$U$2:$U$501, MATCH($B33, Ingredients_DB!$B$2:$B$501,0)),0))","v":""},{"$f":"IF($B33=\"\",\"\",IFERROR(INDEX(Ingredients_DB!$V$2:$V$501, MATCH($B33, Ingredients_DB!$B$2:$B$501,0)),0))","v":""},{"$f":"IF($B33=\"\",\"\",IFERROR(INDEX(Ingredients_DB!$W$2:$W$501, MATCH($B33, Ingredients_DB!$B$2:$B$501,0)),0))","v":""},{"$f":"IF($B33=\"\",\"\",IFERROR(INDEX(Ingredients_DB!$X$2:$X$501, MATCH($B33, Ingredients_DB!$B$2:$B$501,0)),0))","v":""},{"$f":"IF($B33=\"\",\"\",IFERROR(INDEX(Ingredients_DB!$Y$2:$Y$501, MATCH($B33, Ingredients_DB!$B$2:$B$501,0)),0))","v":""},{"$f":"IF($B33=\"\",\"\",IFERROR(INDEX(Ingredients_DB!$Z$2:$Z$501, MATCH($B33, Ingredients_DB!$B$2:$B$501,0)),0))","v":""}]
[14,null,{"v":0,"d":"0.00"},"g",null,"",{"$f":"IF($B34=\"\",\"\",IFERROR(INDEX(Ingredients_DB!$K$2:$K$501, MATCH($B34, Ingredients_DB!$B$2:$B$501,0)),0))","v":""},"",{"$nulls":6},{"$f":"IF($B34=\"\",\"\",IFERROR(INDEX(Ingredients_DB!$H$2:$H$501, MATCH($B34, Ingredients_DB!$B$2:$B$501,0)),\"\"))","v":""},{"$f":"IF($B34=\"\",\"\",IFERROR(INDEX(Ingredients_DB!$I$2:$I$501, MATCH($B34, Ingredients_DB!$B$2:$B$501,0)),\"\"))","v":""},{"$f":"IF($B34=\"\",\"\",IFERROR(VLOOKUP($O34&\"|\"&$D34,UOM_Conversions!$A$2:$E$50,4,FALSE),\"CHECK UNIT\"))","v":""},{"$f":"IF($B34=\"\",\"\",IFERROR(INDEX(Ingredients_DB!$M$2:$M$501, MATCH($B34, Ingredients_DB!$B$2:$B$501,0)),0))","v":""},{"$f":"IF($B34=\"\",\"\",IFERROR(INDEX(Ingredients_DB!$N$2:$N$501, MATCH($B34, Ingredients_DB!$B$2:$B$501,0)),0))","v":""},{"$f":"IF($B34=\"\",\"\",IFERROR(INDEX(Ingredients_DB!$O$2:$O$501, MATCH($B34, Ingredients_DB!$B$2:$B$501,0)),0))","v":""},{"$f":"IF($B34=\"\",\"\",IFERROR(INDEX(Ingredients_DB!$P$2:$P$501, MATCH($B34, Ingredients_DB!$B$2:$B$501,0)),0))","v":""},{"$f":"IF($B34=\"\",\"\",IFERROR(INDEX(Ingredients_DB!$Q$2:$Q$501, MATCH($B34, Ingredients_DB!$B$2:$B$501,0)),0))","v":""},{"$f":"IF($B34=\"\",\"\",IFERROR(INDEX(Ingredients_DB!$R$2:$R$501, MATCH($B34, Ingredients_DB!$B$2:$B$501,0)),0))","v":""},{"$f":"IF($B34=\"\",\"\",IFERROR(INDEX(Ingredients_DB!$S$2:$S$501, MATCH($B34, Ingredients_DB!$B$2:$B$501,0)),0))","v":""},{"$f":"IF($B34=\"\",\"\",IFERROR(INDEX(Ingredients_DB!$T$2:$T$501, MATCH($B34, Ingredients_DB!$B$2:$B$501,0)),0))","v":""},{"$f":"IF($B34=\"\",\"\",IFERROR(INDEX(Ingredients_DB!$U$2:$U$501, MATCH($B34, Ingredients_DB!$B$2:$B$501,0)),0))","v":""},{"$f":"IF($B34=\"\",\"\",IFERROR(INDEX(Ingredients_DB!$V$2:$V$501, MATCH($B34, Ingredients_DB!$B$2:$B$501,0)),0))","v":""},{"$f":"IF($B34=\"\",\"\",IFERROR(INDEX(Ingredients_DB!$W$2:$W$501, MATCH($B34, Ingredients_DB!$B$2:$B$501,0)),0))","v":""},{"$f":"IF($B34=\"\",\"\",IFERROR(INDEX(Ingredients_DB!$X$2:$X$501, MATCH($B34, Ingredients_DB!$B$2:$B$501,0)),0))","v":""},{"$f":"IF($B34=\"\",\"\",IFERROR(INDEX(Ingredients_DB!$Y$2:$Y$501, MATCH($B34, Ingredients_DB!$B$2:$B$501,0)),0))","v":""},{"$f":"IF($B34=\"\",\"\",IFERROR(INDEX(Ingredients_DB!$Z$2:$Z$501, MATCH($B34, Ingredients_DB!$B$2:$B$501,0)),0))","v":""}]
[15,null,{"v":0,"d":"0.00"},"g",null,"",{"$f":"IF($B35=\"\",\"\",IFERROR(INDEX(Ingredients_DB!$K$2:$K$501, MATCH($B35, Ingredients_DB!$B$2:$B$501,0)),0))","v":""},"",{"$nulls":6},{"$f":"IF($B35=\"\",\"\",IFERROR(INDEX(Ingredients_DB!$H$2:$H$501, MATCH($B35, Ingredients_DB!$B$2:$B$501,0)),\"\"))","v":""},{"$f":"IF($B35=\"\",\"\",IFERROR(INDEX(Ingredients_DB!$I$2:$I$501, MATCH($B35, Ingredients_DB!$B$2:$B$501,0)),\"\"))","v":""},{"$f":"IF($B35=\"\",\"\",IFERROR(VLOOKUP($O35&\"|\"&$D35,UOM_Conversions!$A$2:$E$50,4,FALSE),\"CHECK UNIT\"))","v":""},{"$f":"IF($B35=\"\",\"\",IFERROR(INDEX(Ingredients_DB!$M$2:$M$501, MATCH($B35, Ingredients_DB!$B$2:$B$501,0)),0))","v":""},{"$f":"IF($B35=\"\",\"\",IFERROR(INDEX(Ingredients_DB!$N$2:$N$501, MATCH($B35, Ingredients_DB!$B$2:$B$501,0)),0))","v":""},{"$f":"IF($B35=\"\",\"\",IFERROR(INDEX(Ingredients_DB!$O$2:$O$501, MATCH($B35, Ingredients_DB!$B$2:$B$501,0)),0))","v":""},{"$f":"IF($B35=\"\",\"\",IFERROR(INDEX(Ingredients_DB!$P$2:$P$501, MATCH($B35, Ingredients_DB!$B$2:$B$501,0)),0))","v":""},{"$f":"IF($B35=\"\",\"\",IFERROR(INDEX(Ingredients_DB!$Q$2:$Q$501, MATCH($B35, Ingredients_DB!$B$2:$B$501,0)),0))","v":""},{"$f":"IF($B35=\"\",\"\",IFERROR(INDEX(Ingredients_DB!$R$2:$R$501, MATCH($B35, Ingredients_DB!$B$2:$B$501,0)),0))","v":""},{"$f":"IF($B35=\"\",\"\",IFERROR(INDEX(Ingredients_DB!$S$2:$S$501, MATCH($B35, Ingredients_DB!$B$2:$B$501,0)),0))","v":""},{"$f":"IF($B35=\"\",\"\",IFERROR(INDEX(Ingredients_DB!$T$2:$T$501, MATCH($B35, Ingredients_DB!$B$2:$B$501,0)),0))","v":""},{"$f":"IF($B35=\"\",\"\",IFERROR(INDEX(Ingredients_DB!$U$2:$U$501, MATCH($B35, Ingredients_DB!$B$2:$B$501,0)),0))","v":""},{"$f":"IF($B35=\"\",\"\",IFERROR(INDEX(Ingredients_DB!$V$2:$V$501, MATCH($B35, Ingredients_DB!$B$2:$B$501,0)),0))","v":""},{"$f":"IF($B35=\"\",\"\",IFERROR(INDEX(Ingredients_DB!$W$2:$W$501, MATCH($B35, Ingredients_DB!$B$2:$B$501,0)),0))","v":""},{"$f":"IF($B35=\"\",\"\",IFERROR(INDEX(Ingredients_DB!$X$2:$X$501, MATCH($B35, Ingredients_DB!$B$2:$B$501,0)),0))","v":""},{"$f":"IF($B35=\"\",\"\",IFERROR(INDEX(Ingredients_DB!$Y$2:$Y$501, MATCH($B35, Ingredients_DB!$B$2:$B$501,0)),0))","v":""},{"$f":"IF($B35=\"\",\"\",IFERROR(INDEX(Ingredients_DB!$Z$2:$Z$501, MATCH($B35, Ingredients_DB!$B$2:$B$501,0)),0))","v":""}]
[16,null,{"v":0,"d":"0.00"},"g",null,"",{"$f":"IF($B36=\"\",\"\",IFERROR(INDEX(Ingredients_DB!$K$2:$K$501, MATCH($B36, Ingredients_DB!$B$2:$B$501,0)),0))","v":""},"",{"$nulls":6},{"$f":"IF($B36=\"\",\"\",IFERROR(INDEX(Ingredients_DB!$H$2:$H$501, MATCH($B36, Ingredients_DB!$B$2:$B$501,0)),\"\"))","v":""},{"$f":"IF($B36=\"\",\"\",IFERROR(INDEX(Ingredients_DB!$I$2:$I$501, MATCH($B36, Ingredients_DB!$B$2:$B$501,0)),\"\"))","v":""},{"$f":"IF($B36=\"\",\"\",IFERROR(VLOOKUP($O36&\"|\"&$D36,UOM_Conversions!$A$2:$E$50,4,FALSE),\"CHECK UNIT\"))","v":""},{"$f":"IF($B36=\"\",\"\",IFERROR(INDEX(Ingredients_DB!$M$2:$M$501, MATCH($B36, Ingredients_DB!$B$2:$B$501,0)),0))","v":""},{"$f":"IF($B36=\"\",\"\",IFERROR(INDEX(Ingredients_DB!$N$2:$N$501, MATCH($B36, Ingredients_DB!$B$2:$B$501,0)),0))","v":""},{"$f":"IF($B36=\"\",\"\",IFERROR(INDEX(Ingredients_DB!$O$2:$O$501, MATCH($B36, Ingredients_DB!$B$2:$B$501,0)),0))","v":""},{"$f":"IF($B36=\"\",\"\",IFERROR(INDEX(Ingredients_DB!$P$2:$P$501, MATCH($B36, Ingredients_DB!$B$2:$B$501,0)),0))","v":""},{"$f":"IF($B36=\"\",\"\",IFERROR(INDEX(Ingredients_DB!$Q$2:$Q$501, MATCH($B36, Ingredients_DB!$B$2:$B$501,0)),0))","v":""},{"$f":"IF($B36=\"\",\"\",IFERROR(INDEX(Ingredients_DB!$R$2:$R$501, MATCH($B36, Ingredients_DB!$B$2:$B$501,0)),0))","v":""},{"$f":"IF($B36=\"\",\"\",IFERROR(INDEX(Ingredients_DB!$S$2:$S$501, MATCH($B36, Ingredients_DB!$B$2:$B$501,0)),0))","v":""},{"$f":"IF($B36=\"\",\"\",IFERROR(INDEX(Ingredients_DB!$T$2:$T$501, MATCH($B36, Ingredients_DB!$B$2:$B$501,0)),0))","v":""},{"$f":"IF($B36=\"\",\"\",IFERROR(INDEX(Ingredients_DB!$U$2:$U$501, MATCH($B36, Ingredients_DB!$B$2:$B$501,0)),0))","v":""},{"$f":"IF($B36=\"\",\"\",IFERROR(INDEX(Ingredients_DB!$V$2:$V$501, MATCH($B36, Ingredients_DB!$B$2:$B$501,0)),0))","v":""},{"$f":"IF($B36=\"\",\"\",IFERROR(INDEX(Ingredients_DB!$W$2:$W$501, MATCH($B36, Ingredients_DB!$B$2:$B$501,0)),0))","v":""},{"$f":"IF($B36=\"\",\"\",IFERROR(INDEX(Ingredients_DB!$X$2:$X$501, MATCH($B36, Ingredients_DB!$B$2:$B$501,0)),0))","v":""},{"$f":"IF($B36=\"\",\"\",IFERROR(INDEX(Ingredients_DB!$Y$2:$Y$501, MATCH($B36, Ingredients_DB!$B$2:$B$501,0)),0))","v":""},{"$f":"IF($B36=\"\",\"\",IFERROR(INDEX(Ingredients_DB!$Z$2:$Z$501, MATCH($B36, Ingredients_DB!$B$2:$B$501,0)),0))","v":""}]
[17,null,{"v":0,"d":"0.00"},"g",null,"",{"$f":"IF($B37=\"\",\"\",IFERROR(INDEX(Ingredients_DB!$K$2:$K$501, MATCH($B37, Ingredients_DB!$B$2:$B$501,0)),0))","v":""},"",{"$nulls":6},{"$f":"IF($B37=\"\",\"\",IFERROR(INDEX(Ingredients_DB!$H$2:$H$501, MATCH($B37, Ingredients_DB!$B$2:$B$501,0)),\"\"))","v":""},{"$f":"IF($B37=\"\",\"\",IFERROR(INDEX(Ingredients_DB!$I$2:$I$501, MATCH($B37, Ingredients_DB!$B$2:$B$501,0)),\"\"))","v":""},{"$f":"IF($B37=\"\",\"\",IFERROR(VLOOKUP($O37&\"|\"&$D37,UOM_Conversions!$A$2:$E$50,4,FALSE),\"CHECK UNIT\"))","v":""},{"$f":"IF($B37=\"\",\"\",IFERROR(INDEX(Ingredients_DB!$M$2:$M$501, MATCH($B37, Ingredients_DB!$B$2:$B$501,0)),0))","v":""},{"$f":"IF($B37=\"\",\"\",IFERROR(INDEX(Ingredients_DB!$N$2:$N$501, MATCH($B37, Ingredients_DB!$B$2:$B$501,0)),0))","v":""},{"$f":"IF($B37=\"\",\"\",IFERROR(INDEX(Ingredients_DB!$O$2:$O$501, MATCH($B37, Ingredients_DB!$B$2:$B$501,0)),0))","v":""},{"$f":"IF($B37=\"\",\"\",IFERROR(INDEX(Ingredients_DB!$P$2:$P$501, MATCH($B37, Ingredients_DB!$B$2:$B$501,0)),0))","v":""},{"$f":"IF($B37=\"\",\"\",IFERROR(INDEX(Ingredients_DB!$Q$2:$Q$501, MATCH($B37, Ingredients_DB!$B$2:$B$501,0)),0))","v":""},{"$f":"IF($B37=\"\",\"\",IFERROR(INDEX(Ingredients_DB!$R$2:$R$501, MATCH($B37, Ingredients_DB!$B$2:$B$501,0)),0))","v":""},{"$f":"IF($B37=\"\",\"\",IFERROR(INDEX(Ingredients_DB!$S$2:$S$501, MATCH($B37, Ingredients_DB!$B$2:$B$501,0)),0))","v":""},{"$f":"IF($B37=\"\",\"\",IFERROR(INDEX(Ingredients_DB!$T$2:$T$501, MATCH($B37, Ingredients_DB!$B$2:$B$501,0)),0))","v":""},{"$f":"IF($B37=\"\",\"\",IFERROR(INDEX(Ingredients_DB!$U$2:$U$501, MATCH($B37, Ingredients_DB!$B$2:$B$501,0)),0))","v":""},{"$f":"IF($B37=\"\",\"\",IFERROR(INDEX(Ingredients_DB!$V$2:$V$501, MATCH($B37, Ingredients_DB!$B$2:$B$501,0)),0))","v":""},{"$f":"IF($B37=\"\",\"\",IFERROR(INDEX(Ingredients_DB!$W$2:$W$501, MATCH($B37, Ingredients_DB!$B$2:$B$501,0)),0))","v":""},{"$f":"IF($B37=\"\",\"\",IFERROR(INDEX(Ingredients_DB!$X$2:$X$501, MATCH($B37, Ingredients_DB!$B$2:$B$501,0)),0))","v":""},{"$f":"IF($B37=\"\",\"\",IFERROR(INDEX(Ingredients_DB!$Y$2:$Y$501, MATCH($B37, Ingredients_DB!$B$2:$B$501,0)),0))","v":""},{"$f":"IF($B37=\"\",\"\",IFERROR(INDEX(Ingredients_DB!$Z$2:$Z$501, MATCH($B37, Ingredients_DB!$B$2:$B$501,0)),0))","v":""}]
[18,null,{"v":0,"d":"0.00"},"g",null,"",{"$f":"IF($B38=\"\",\"\",IFERROR(INDEX(Ingredients_DB!$K$2:$K$501, MATCH($B38, Ingredients_DB!$B$2:$B$501,0)),0))","v":""},"",{"$nulls":6},{"$f":"IF($B38=\"\",\"\",IFERROR(INDEX(Ingredients_DB!$H$2:$H$501, MATCH($B38, Ingredients_DB!$B$2:$B$501,0)),\"\"))","v":""},{"$f":"IF($B38=\"\",\"\",IFERROR(INDEX(Ingredients_DB!$I$2:$I$501, MATCH($B38, Ingredients_DB!$B$2:$B$501,0)),\"\"))","v":""},{"$f":"IF($B38=\"\",\"\",IFERROR(VLOOKUP($O38&\"|\"&$D38,UOM_Conversions!$A$2:$E$50,4,FALSE),\"CHECK UNIT\"))","v":""},{"$f":"IF($B38=\"\",\"\",IFERROR(INDEX(Ingredients_DB!$M$2:$M$501, MATCH($B38, Ingredients_DB!$B$2:$B$501,0)),0))","v":""},{"$f":"IF($B38=\"\",\"\",IFERROR(INDEX(Ingredients_DB!$N$2:$N$501, MATCH($B38, Ingredients_DB!$B$2:$B$501,0)),0))","v":""},{"$f":"IF($B38=\"\",\"\",IFERROR(INDEX(Ingredients_DB!$O$2:$O$501, MATCH($B38, Ingredients_DB!$B$2:$B$501,0)),0))","v":""},{"$f":"IF($B38=\"\",\"\",IFERROR(INDEX(Ingredients_DB!$P$2:$P$501, MATCH($B38, Ingredients_DB!$B$2:$B$501,0)),0))","v":""},{"$f":"IF($B38=\"\",\"\",IFERROR(INDEX(Ingredients_DB!$Q$2:$Q$501, MATCH($B38, Ingredients_DB!$B$2:$B$501,0)),0))","v":""},{"$f":"IF($B38=\"\",\"\",IFERROR(INDEX(Ingredients_DB!$R$2:$R$501, MATCH($B38, Ingredients_DB!$B$2:$B$501,0)),0))","v":""},{"$f":"IF($B38=\"\",\"\",IFERROR(INDEX(Ingredients_DB!$S$2:$S$501, MATCH($B38, Ingredients_DB!$B$2:$B$501,0)),0))","v":""},{"$f":"IF($B38=\"\",\"\",IFERROR(INDEX(Ingredients_DB!$T$2:$T$501, MATCH($B38, Ingredients_DB!$B$2:$B$501,0)),0))","v":""},{"$f":"IF($B38=\"\",\"\",IFERROR(INDEX(Ingredients_DB!$U$2:$U$501, MATCH($B38, Ingredients_DB!$B$2:$B$501,0)),0))","v":""},{"$f":"IF($B38=\"\",\"\",IFERROR(INDEX(Ingredients_DB!$V$2:$V$501, MATCH($B38, Ingredients_DB!$B$2:$B$501,0)),0))","v":""},{"$f":"IF($B38=\"\",\"\",IFERROR(INDEX(Ingredients_DB!$W$2:$W$501, MATCH($B38, Ingredients_DB!$B$2:$B$501,0)),0))","v":""},{"$f":"IF($B38=\"\",\"\",IFERROR(INDEX(Ingredients_DB!$X$2:$X$501, MATCH($B38, Ingredients_DB!$B$2:$B$501,0)),0))","v":""},{"$f":"IF($B38=\"\",\"\",IFERROR(INDEX(Ingredients_DB!$Y$2:$Y$501, MATCH($B38, Ingredients_DB!$B$2:$B$501,0)),0))","v":""},{"$f":"IF($B38=\"\",\"\",IFERROR(INDEX(Ingredients_DB!$Z$2:$Z$501, MATCH($B38, Ingredients_DB!$B$2:$B$501,0)),0))","v":""}]
[19,null,{"v":0,"d":"0.00"},"g",null,"",{"$f":"IF($B39=\"\",\"\",IFERROR(INDEX(Ingredients_DB!$K$2:$K$501, MATCH($B39, Ingredients_DB!$B$2:$B$501,0)),0))","v":""},"",{"$nulls":6},{"$f":"IF($B39=\"\",\"\",IFERROR(INDEX(Ingredients_DB!$H$2:$H$501, MATCH($B39, Ingredients_DB!$B$2:$B$501,0)),\"\"))","v":""},{"$f":"IF($B39=\"\",\"\",IFERROR(INDEX(Ingredients_DB!$I$2:$I$501, MATCH($B39, Ingredients_DB!$B$2:$B$501,0)),\"\"))","v":""},{"$f":"IF($B39=\"\",\"\",IFERROR(VLOOKUP($O39&\"|\"&$D39,UOM_Conversions!$A$2:$E$50,4,FALSE),\"CHECK UNIT\"))","v":""},{"$f":"IF($B39=\"\",\"\",IFERROR(INDEX(Ingredients_DB!$M$2:$M$501, MATCH($B39, Ingredients_DB!$B$2:$B$501,0)),0))","v":""},{"$f":"IF($B39=\"\",\"\",IFERROR(INDEX(Ingredients_DB!$N$2:$N$501, MATCH($B39, Ingredients_DB!$B$2:$B$501,0)),0))","v":""},{"$f":"IF($B39=\"\",\"\",IFERROR(INDEX(Ingredients_DB!$O$2:$O$501, MATCH($B39, Ingredients_DB!$B$2:$B$501,0)),0))","v":""},{"$f":"IF($B39=\"\",\"\",IFERROR(INDEX(Ingredients_DB!$P$2:$P$501, MATCH($B39, Ingredients_DB!$B$2:$B$501,0)),0))","v":""},{"$f":"IF($B39=\"\",\"\",IFERROR(INDEX(Ingredients_DB!$Q$2:$Q$501, MATCH($B39, Ingredients_DB!$B$2:$B$501,0)),0))","v":""},{"$f":"IF($B39=\"\",\"\",IFERROR(INDEX(Ingredients_DB!$R$2:$R$501, MATCH($B39, Ingredients_DB!$B$2:$B$501,0)),0))","v":""},{"$f":"IF($B39=\"\",\"\",IFERROR(INDEX(Ingredients_DB!$S$2:$S$501, MATCH($B39, Ingredients_DB!$B$2:$B$501,0)),0))","v":""},{"$f":"IF($B39=\"\",\"\",IFERROR(INDEX(Ingredients_DB!$T$2:$T$501, MATCH($B39, Ingredients_DB!$B$2:$B$501,0)),0))","v":""},{"$f":"IF($B39=\"\",\"\",IFERROR(INDEX(Ingredients_DB!$U$2:$U$501, MATCH($B39, Ingredients_DB!$B$2:$B$501,0)),0))","v":""},{"$f":"IF($B39=\"\",\"\",IFERROR(INDEX(Ingredients_DB!$V$2:$V$501, MATCH($B39, Ingredients_DB!$B$2:$B$501,0)),0))","v":""},{"$f":"IF($B39=\"\",\"\",IFERROR(INDEX(Ingredients_DB!$W$2:$W$501, MATCH($B39, Ingredients_DB!$B$2:$B$501,0)),0))","v":""},{"$f":"IF($B39=\"\",\"\",IFERROR(INDEX(Ingredients_DB!$X$2:$X$501, MATCH($B39, Ingredients_DB!$B$2:$B$501,0)),0))","v":""},{"$f":"IF($B39=\"\",\"\",IFERROR(INDEX(Ingredients_DB!$Y$2:$Y$501, MATCH($B39, Ingredients_DB!$B$2:$B$501,0)),0))","v":""},{"$f":"IF($B39=\"\",\"\",IFERROR(INDEX(Ingredients_DB!$Z$2:$Z$501, MATCH($B39, Ingredients_DB!$B$2:$B$501,0)),0))","v":""}]
[20,null,{"v":0,"d":"0.00"},"g",null,"",{"$f":"IF($B40=\"\",\"\",IFERROR(INDEX(Ingredients_DB!$K$2:$K$501, MATCH($B40, Ingredients_DB!$B$2:$B$501,0)),0))","v":""},"",{"$nulls":6},{"$f":"IF($B40=\"\",\"\",IFERROR(INDEX(Ingredients_DB!$H$2:$H$501, MATCH($B40, Ingredients_DB!$B$2:$B$501,0)),\"\"))","v":""},{"$f":"IF($B40=\"\",\"\",IFERROR(INDEX(Ingredients_DB!$I$2:$I$501, MATCH($B40, Ingredients_DB!$B$2:$B$501,0)),\"\"))","v":""},{"$f":"IF($B40=\"\",\"\",IFERROR(VLOOKUP($O40&\"|\"&$D40,UOM_Conversions!$A$2:$E$50,4,FALSE),\"CHECK UNIT\"))","v":""},{"$f":"IF($B40=\"\",\"\",IFERROR(INDEX(Ingredients_DB!$M$2:$M$501, MATCH($B40, Ingredients_DB!$B$2:$B$501,0)),0))","v":""},{"$f":"IF($B40=\"\",\"\",IFERROR(INDEX(Ingredients_DB!$N$2:$N$501, MATCH($B40, Ingredients_DB!$B$2:$B$501,0)),0))","v":""},{"$f":"IF($B40=\"\",\"\",IFERROR(INDEX(Ingredients_DB!$O$2:$O$501, MATCH($B40, Ingredients_DB!$B$2:$B$501,0)),0))","v":""},{"$f":"IF($B40=\"\",\"\",IFERROR(INDEX(Ingredients_DB!$P$2:$P$501, MATCH($B40, Ingredients_DB!$B$2:$B$501,0)),0))","v":""},{"$f":"IF($B40=\"\",\"\",IFERROR(INDEX(Ingredients_DB!$Q$2:$Q$501, MATCH($B40, Ingredients_DB!$B$2:$B$501,0)),0))","v":""},{"$f":"IF($B40=\"\",\"\",IFERROR(INDEX(Ingredients_DB!$R$2:$R$501, MATCH($B40, Ingredients_DB!$B$2:$B$501,0)),0))","v":""},{"$f":"IF($B40=\"\",\"\",IFERROR(INDEX(Ingredients_DB!$S$2:$S$501, MATCH($B40, Ingredients_DB!$B$2:$B$501,0)),0))","v":""},{"$f":"IF($B40=\"\",\"\",IFERROR(INDEX(Ingredients_DB!$T$2:$T$501, MATCH($B40, Ingredients_DB!$B$2:$B$501,0)),0))","v":""},{"$f":"IF($B40=\"\",\"\",IFERROR(INDEX(Ingredients_DB!$U$2:$U$501, MATCH($B40, Ingredients_DB!$B$2:$B$501,0)),0))","v":""},{"$f":"IF($B40=\"\",\"\",IFERROR(INDEX(Ingredients_DB!$V$2:$V$501, MATCH($B40, Ingredients_DB!$B$2:$B$501,0)),0))","v":""},{"$f":"IF($B40=\"\",\"\",IFERROR(INDEX(Ingredients_DB!$W$2:$W$501, MATCH($B40, Ingredients_DB!$B$2:$B$501,0)),0))","v":""},{"$f":"IF($B40=\"\",\"\",IFERROR(INDEX(Ingredients_DB!$X$2:$X$501, MATCH($B40, Ingredients_DB!$B$2:$B$501,0)),0))","v":""},{"$f":"IF($B40=\"\",\"\",IFERROR(INDEX(Ingredients_DB!$Y$2:$Y$501, MATCH($B40, Ingredients_DB!$B$2:$B$501,0)),0))","v":""},{"$f":"IF($B40=\"\",\"\",IFERROR(INDEX(Ingredients_DB!$Z$2:$Z$501, MATCH($B40, Ingredients_DB!$B$2:$B$501,0)),0))","v":""}]
[21,null,{"v":0,"d":"0.00"},"g",null,"",{"$f":"IF($B41=\"\",\"\",IFERROR(INDEX(Ingredients_DB!$K$2:$K$501, MATCH($B41, Ingredients_DB!$B$2:$B$501,0)),0))","v":""},"",{"$nulls":6},{"$f":"IF($B41=\"\",\"\",IFERROR(INDEX(Ingredients_DB!$H$2:$H$501, MATCH($B41, Ingredients_DB!$B$2:$B$501,0)),\"\"))","v":""},{"$f":"IF($B41=\"\",\"\",IFERROR(INDEX(Ingredients_DB!$I$2:$I$501, MATCH($B41, Ingredients_DB!$B$2:$B$501,0)),\"\"))","v":""},{"$f":"IF($B41=\"\",\"\",IFERROR(VLOOKUP($O41&\"|\"&$D41,UOM_Conversions!$A$2:$E$50,4,FALSE),\"CHECK UNIT\"))","v":""},{"$f":"IF($B41=\"\",\"\",IFERROR(INDEX(Ingredients_DB!$M$2:$M$501, MATCH($B41, Ingredients_DB!$B$2:$B$501,0)),0))","v":""},{"$f":"IF($B41=\"\",\"\",IFERROR(INDEX(Ingredients_DB!$N$2:$N$501, MATCH($B41, Ingredients_DB!$B$2:$B$501,0)),0))","v":""},{"$f":"IF($B41=\"\",\"\",IFERROR(INDEX(Ingredients_DB!$O$2:$O$501, MATCH($B41, Ingredients_DB!$B$2:$B$501,0)),0))","v":""},{"$f":"IF($B41=\"\",\"\",IFERROR(INDEX(Ingredients_DB!$P$2:$P$501, MATCH($B41, Ingredients_DB!$B$2:$B$501,0)),0))","v":""},{"$f":"IF($B41=\"\",\"\",IFERROR(INDEX(Ingredients_DB!$Q$2:$Q$501, MATCH($B41, Ingredients_DB!$B$2:$B$501,0)),0))","v":""},{"$f":"IF($B41=\"\",\"\",IFERROR(INDEX(Ingredients_DB!$R$2:$R$501, MATCH($B41, Ingredients_DB!$B$2:$B$501,0)),0))","v":""},{"$f":"IF($B41=\"\",\"\",IFERROR(INDEX(Ingredients_DB!$S$2:$S$501, MATCH($B41, Ingredients_DB!$B$2:$B$501,0)),0))","v":""},{"$f":"IF($B41=\"\",\"\",IFERROR(INDEX(Ingredients_DB!$T$2:$T$501, MATCH($B41, Ingredients_DB!$B$2:$B$501,0)),0))","v":""},{"$f":"IF($B41=\"\",\"\",IFERROR(INDEX(Ingredients_DB!$U$2:$U$501, MATCH($B41, Ingredients_DB!$B$2:$B$501,0)),0))","v":""},{"$f":"IF($B41=\"\",\"\",IFERROR(INDEX(Ingredients_DB!$V$2:$V$501, MATCH($B41, Ingredients_DB!$B$2:$B$501,0)),0))","v":""},{"$f":"IF($B41=\"\",\"\",IFERROR(INDEX(Ingredients_DB!$W$2:$W$501, MATCH($B41, Ingredients_DB!$B$2:$B$501,0)),0))","v":""},{"$f":"IF($B41=\"\",\"\",IFERROR(INDEX(Ingredients_DB!$X$2:$X$501, MATCH($B41, Ingredients_DB!$B$2:$B$501,0)),0))","v":""},{"$f":"IF($B41=\"\",\"\",IFERROR(INDEX(Ingredients_DB!$Y$2:$Y$501, MATCH($B41, Ingredients_DB!$B$2:$B$501,0)),0))","v":""},{"$f":"IF($B41=\"\",\"\",IFERROR(INDEX(Ingredients_DB!$Z$2:$Z$501, MATCH($B41, Ingredients_DB!$B$2:$B$501,0)),0))","v":""}]
[22,null,{"v":0,"d":"0.00"},"g",null,"",{"$f":"IF($B42=\"\",\"\",IFERROR(INDEX(Ingredients_DB!$K$2:$K$501, MATCH($B42, Ingredients_DB!$B$2:$B$501,0)),0))","v":""},"",{"$nulls":6},{"$f":"IF($B42=\"\",\"\",IFERROR(INDEX(Ingredients_DB!$H$2:$H$501, MATCH($B42, Ingredients_DB!$B$2:$B$501,0)),\"\"))","v":""},{"$f":"IF($B42=\"\",\"\",IFERROR(INDEX(Ingredients_DB!$I$2:$I$501, MATCH($B42, Ingredients_DB!$B$2:$B$501,0)),\"\"))","v":""},{"$f":"IF($B42=\"\",\"\",IFERROR(VLOOKUP($O42&\"|\"&$D42,UOM_Conversions!$A$2:$E$50,4,FALSE),\"CHECK UNIT\"))","v":""},{"$f":"IF($B42=\"\",\"\",IFERROR(INDEX(Ingredients_DB!$M$2:$M$501, MATCH($B42, Ingredients_DB!$B$2:$B$501,0)),0))","v":""},{"$f":"IF($B42=\"\",\"\",IFERROR(INDEX(Ingredients_DB!$N$2:$N$501, MATCH($B42, Ingredients_DB!$B$2:$B$501,0)),0))","v":""},{"$f":"IF($B42=\"\",\"\",IFERROR(INDEX(Ingredients_DB!$O$2:$O$501, MATCH($B42, Ingredients_DB!$B$2:$B$501,0)),0))","v":""},{"$f":"IF($B42=\"\",\"\",IFERROR(INDEX(Ingredients_DB!$P$2:$P$501, MATCH($B42, Ingredients_DB!$B$2:$B$501,0)),0))","v":""},{"$f":"IF($B42=\"\",\"\",IFERROR(INDEX(Ingredients_DB!$Q$2:$Q$501, MATCH($B42, Ingredients_DB!$B$2:$B$501,0)),0))","v":""},{"$f":"IF($B42=\"\",\"\",IFERROR(INDEX(Ingredients_DB!$R$2:$R$501, MATCH($B42, Ingredients_DB!$B$2:$B$501,0)),0))","v":""},{"$f":"IF($B42=\"\",\"\",IFERROR(INDEX(Ingredients_DB!$S$2:$S$501, MATCH($B42, Ingredients_DB!$B$2:$B$501,0)),0))","v":""},{"$f":"IF($B42=\"\",\"\",IFERROR(INDEX(Ingredients_DB!$T$2:$T$501, MATCH($B42, Ingredients_DB!$B$2:$B$501,0)),0))","v":""},{"$f":"IF($B42=\"\",\"\",IFERROR(INDEX(Ingredients_DB!$U$2:$U$501, MATCH($B42, Ingredients_DB!$B$2:$B$501,0)),0))","v":""},{"$f":"IF($B42=\"\",\"\",IFERROR(INDEX(Ingredients_DB!$V$2:$V$501, MATCH($B42, Ingredients_DB!$B$2:$B$501,0)),0))","v":""},{"$f":"IF($B42=\"\",\"\",IFERROR(INDEX(Ingredients_DB!$W$2:$W$501, MATCH($B42, Ingredients_DB!$B$2:$B$501,0)),0))","v":""},{"$f":"IF($B42=\"\",\"\",IFERROR(INDEX(Ingredients_DB!$X$2:$X$501, MATCH($B42, Ingredients_DB!$B$2:$B$501,0)),0))","v":""},{"$f":"IF($B42=\"\",\"\",IFERROR(INDEX(Ingredients_DB!$Y$2:$Y$501, MATCH($B42, Ingredients_DB!$B$2:$B$501,0)),0))","v":""},{"$f":"IF($B42=\"\",\"\",IFERROR(INDEX(Ingredients_DB!$Z$2:$Z$501, MATCH($B42, Ingredients_DB!$B$2:$B$501,0)),0))","v":""}]
[23,null,{"v":0,"d":"0.00"},"g",null,"",{"$f":"IF($B43=\"\",\"\",IFERROR(INDEX(Ingredients_DB!$K$2:$K$501, MATCH($B43, Ingredients_DB!$B$2:$B$501,0)),0))","v":""},"",{"$nulls":6},{"$f":"IF($B43=\"\",\"\",IFERROR(INDEX(Ingredients_DB!$H$2:$H$501, MATCH($B43, Ingredients_DB!$B$2:$B$501,0)),\"\"))","v":""},{"$f":"IF($B43=\"\",\"\",IFERROR(INDEX(Ingredients_DB!$I$2:$I$501, MATCH($B43, Ingredients_DB!$B$2:$B$501,0)),\"\"))","v":""},{"$f":"IF($B43=\"\",\"\",IFERROR(VLOOKUP($O43&\"|\"&$D43,UOM_Conversions!$A$2:$E$50,4,FALSE),\"CHECK UNIT\"))","v":""},{"$f":"IF($B43=\"\",\"\",IFERROR(INDEX(Ingredients_DB!$M$2:$M$501, MATCH($B43, Ingredients_DB!$B$2:$B$501,0)),0))","v":""},{"$f":"IF($B43=\"\",\"\",IFERROR(INDEX(Ingredients_DB!$N$2:$N$501, MATCH($B43, Ingredients_DB!$B$2:$B$501,0)),0))","v":""},{"$f":"IF($B43=\"\",\"\",IFERROR(INDEX(Ingredients_DB!$O$2:$O$501, MATCH($B43, Ingredients_DB!$B$2:$B$501,0)),0))","v":""},{"$f":"IF($B43=\"\",\"\",IFERROR(INDEX(Ingredients_DB!$P$2:$P$501, MATCH($B43, Ingredients_DB!$B$2:$B$501,0)),0))","v":""},{"$f":"IF($B43=\"\",\"\",IFERROR(INDEX(Ingredients_DB!$Q$2:$Q$501, MATCH($B43, Ingredients_DB!$B$2:$B$501,0)),0))","v":""},{"$f":"IF($B43=\"\",\"\",IFERROR(INDEX(Ingredients_DB!$R$2:$R$501, MATCH($B43, Ingredients_DB!$B$2:$B$501,0)),0))","v":""},{"$f":"IF($B43=\"\",\"\",IFERROR(INDEX(Ingredients_DB!$S$2:$S$501, MATCH($B43, Ingredients_DB!$B$2:$B$501,0)),0))","v":""},{"$f":"IF($B43=\"\",\"\",IFERROR(INDEX(Ingredients_DB!$T$2:$T$501, MATCH($B43, Ingredients_DB!$B$2:$B$501,0)),0))","v":""},{"$f":"IF($B43=\"\",\"\",IFERROR(INDEX(Ingredients_DB!$U$2:$U$501, MATCH($B43, Ingredients_DB!$B$2:$B$501,0)),0))","v":""},{"$f":"IF($B43=\"\",\"\",IFERROR(INDEX(Ingredients_DB!$V$2:$V$501, MATCH($B43, Ingredients_DB!$B$2:$B$501,0)),0))","v":""},{"$f":"IF($B43=\"\",\"\",IFERROR(INDEX(Ingredients_DB!$W$2:$W$501, MATCH($B43, Ingredients_DB!$B$2:$B$501,0)),0))","v":""},{"$f":"IF($B43=\"\",\"\",IFERROR(INDEX(Ingredients_DB!$X$2:$X$501, MATCH($B43, Ingredients_DB!$B$2:$B$501,0)),0))","v":""},{"$f":"IF($B43=\"\",\"\",IFERROR(INDEX(Ingredients_DB!$Y$2:$Y$501, MATCH($B43, Ingredients_DB!$B$2:$B$501,0)),0))","v":""},{"$f":"IF($B43=\"\",\"\",IFERROR(INDEX(Ingredients_DB!$Z$2:$Z$501, MATCH($B43, Ingredients_DB!$B$2:$B$501,0)),0))","v":""}]
[24,null,{"v":0,"d":"0.00"},"g",null,"",{"$f":"IF($B44=\"\",\"\",IFERROR(INDEX(Ingredients_DB!$K$2:$K$501, MATCH($B44, Ingredients_DB!$B$2:$B$501,0)),0))","v":""},"",{"$nulls":6},{"$f":"IF($B44=\"\",\"\",IFERROR(INDEX(Ingredients_DB!$H$2:$H$501, MATCH($B44, Ingredients_DB!$B$2:$B$501,0)),\"\"))","v":""},{"$f":"IF($B44=\"\",\"\",IFERROR(INDEX(Ingredients_DB!$I$2:$I$501, MATCH($B44, Ingredients_DB!$B$2:$B$501,0)),\"\"))","v":""},{"$f":"IF($B44=\"\",\"\",IFERROR(VLOOKUP($O44&\"|\"&$D44,UOM_Conversions!$A$2:$E$50,4,FALSE),\"CHECK UNIT\"))","v":""},{"$f":"IF($B44=\"\",\"\",IFERROR(INDEX(Ingredients_DB!$M$2:$M$501, MATCH($B44, Ingredients_DB!$B$2:$B$501,0)),0))","v":""},{"$f":"IF($B44=\"\",\"\",IFERROR(INDEX(Ingredients_DB!$N$2:$N$501, MATCH($B44, Ingredients_DB!$B$2:$B$501,0)),0))","v":""},{"$f":"IF($B44=\"\",\"\",IFERROR(INDEX(Ingredients_DB!$O$2:$O$501, MATCH($B44, Ingredients_DB!$B$2:$B$501,0)),0))","v":""},{"$f":"IF($B44=\"\",\"\",IFERROR(INDEX(Ingredients_DB!$P$2:$P$501, MATCH($B44, Ingredients_DB!$B$2:$B$501,0)),0))","v":""},{"$f":"IF($B44=\"\",\"\",IFERROR(INDEX(Ingredients_DB!$Q$2:$Q$501, MATCH($B44, Ingredients_DB!$B$2:$B$501,0)),0))","v":""},{"$f":"IF($B44=\"\",\"\",IFERROR(INDEX(Ingredients_DB!$R$2:$R$501, MATCH($B44, Ingredients_DB!$B$2:$B$501,0)),0))","v":""},{"$f":"IF($B44=\"\",\"\",IFERROR(INDEX(Ingredients_DB!$S$2:$S$501, MATCH($B44, Ingredients_DB!$B$2:$B$501,0)),0))","v":""},{"$f":"IF($B44=\"\",\"\",IFERROR(INDEX(Ingredients_DB!$T$2:$T$501, MATCH($B44, Ingredients_DB!$B$2:$B$501,0)),0))","v":""},{"$f":"IF($B44=\"\",\"\",IFERROR(INDEX(Ingredients_DB!$U$2:$U$501, MATCH($B44, Ingredients_DB!$B$2:$B$501,0)),0))","v":""},{"$f":"IF($B44=\"\",\"\",IFERROR(INDEX(Ingredients_DB!$V$2:$V$501, MATCH($B44, Ingredients_DB!$B$2:$B$501,0)),0))","v":""},{"$f":"IF($B44=\"\",\"\",IFERROR(INDEX(Ingredients_DB!$W$2:$W$501, MATCH($B44, Ingredients_DB!$B$2:$B$501,0)),0))","v":""},{"$f":"IF($B44=\"\",\"\",IFERROR(INDEX(Ingredients_DB!$X$2:$X$501, MATCH($B44, Ingredients_DB!$B$2:$B$501,0)),0))","v":""},{"$f":"IF($B44=\"\",\"\",IFERROR(INDEX(Ingredients_DB!$Y$2:$Y$501, MATCH($B44, Ingredients_DB!$B$2:$B$501,0)),0))","v":""},{"$f":"IF($B44=\"\",\"\",IFERROR(INDEX(Ingredients_DB!$Z$2:$Z$501, MATCH($B44, Ingredients_DB!$B$2:$B$501,0)),0))","v":""}]
[25,null,{"v":0,"d":"0.00"},"g",null,"",{"$f":"IF($B45=\"\",\"\",IFERROR(INDEX(Ingredients_DB!$K$2:$K$501, MATCH($B45, Ingredients_DB!$B$2:$B$501,0)),0))","v":""},"",{"$nulls":6},{"$f":"IF($B45=\"\",\"\",IFERROR(INDEX(Ingredients_DB!$H$2:$H$501, MATCH($B45, Ingredients_DB!$B$2:$B$501,0)),\"\"))","v":""},{"$f":"IF($B45=\"\",\"\",IFERROR(INDEX(Ingredients_DB!$I$2:$I$501, MATCH($B45, Ingredients_DB!$B$2:$B$501,0)),\"\"))","v":""},{"$f":"IF($B45=\"\",\"\",IFERROR(VLOOKUP($O45&\"|\"&$D45,UOM_Conversions!$A$2:$E$50,4,FALSE),\"CHECK UNIT\"))","v":""},{"$f":"IF($B45=\"\",\"\",IFERROR(INDEX(Ingredients_DB!$M$2:$M$501, MATCH($B45, Ingredients_DB!$B$2:$B$501,0)),0))","v":""},{"$f":"IF($B45=\"\",\"\",IFERROR(INDEX(Ingredients_DB!$N$2:$N$501, MATCH($B45, Ingredients_DB!$B$2:$B$501,0)),0))","v":""},{"$f":"IF($B45=\"\",\"\",IFERROR(INDEX(Ingredients_DB!$O$2:$O$501, MATCH($B45, Ingredients_DB!$B$2:$B$501,0)),0))","v":""},{"$f":"IF($B45=\"\",\"\",IFERROR(INDEX(Ingredients_DB!$P$2:$P$501, MATCH($B45, Ingredients_DB!$B$2:$B$501,0)),0))","v":""},{"$f":"IF($B45=\"\",\"\",IFERROR(INDEX(Ingredients_DB!$Q$2:$Q$501, MATCH($B45, Ingredients_DB!$B$2:$B$501,0)),0))","v":""},{"$f":"IF($B45=\"\",\"\",IFERROR(INDEX(Ingredients_DB!$R$2:$R$501, MATCH($B45, Ingredients_DB!$B$2:$B$501,0)),0))","v":""},{"$f":"IF($B45=\"\",\"\",IFERROR(INDEX(Ingredients_DB!$S$2:$S$501, MATCH($B45, Ingredients_DB!$B$2:$B$501,0)),0))","v":""},{"$f":"IF($B45=\"\",\"\",IFERROR(INDEX(Ingredients_DB!$T$2:$T$501, MATCH($B45, Ingredients_DB!$B$2:$B$501,0)),0))","v":""},{"$f":"IF($B45=\"\",\"\",IFERROR(INDEX(Ingredients_DB!$U$2:$U$501, MATCH($B45, Ingredients_DB!$B$2:$B$501,0)),0))","v":""},{"$f":"IF($B45=\"\",\"\",IFERROR(INDEX(Ingredients_DB!$V$2:$V$501, MATCH($B45, Ingredients_DB!$B$2:$B$501,0)),0))","v":""},{"$f":"IF($B45=\"\",\"\",IFERROR(INDEX(Ingredients_DB!$W$2:$W$501, MATCH($B45, Ingredients_DB!$B$2:$B$501,0)),0))","v":""},{"$f":"IF($B45=\"\",\"\",IFERROR(INDEX(Ingredients_DB!$X$2:$X$501, MATCH($B45, Ingredients_DB!$B$2:$B$501,0)),0))","v":""},{"$f":"IF($B45=\"\",\"\",IFERROR(INDEX(Ingredients_DB!$Y$2:$Y$501, MATCH($B45, Ingredients_DB!$B$2:$B$501,0)),0))","v":""},{"$f":"IF($B45=\"\",\"\",IFERROR(INDEX(Ingredients_DB!$Z$2:$Z$501, MATCH($B45, Ingredients_DB!$B$2:$B$501,0)),0))","v":""}]
[26,null,{"v":0,"d":"0.00"},"g",null,"",{"$f":"IF($B46=\"\",\"\",IFERROR(INDEX(Ingredients_DB!$K$2:$K$501, MATCH($B46, Ingredients_DB!$B$2:$B$501,0)),0))","v":""},"",{"$nulls":6},{"$f":"IF($B46=\"\",\"\",IFERROR(INDEX(Ingredients_DB!$H$2:$H$501, MATCH($B46, Ingredients_DB!$B$2:$B$501,0)),\"\"))","v":""},{"$f":"IF($B46=\"\",\"\",IFERROR(INDEX(Ingredients_DB!$I$2:$I$501, MATCH($B46, Ingredients_DB!$B$2:$B$501,0)),\"\"))","v":""},{"$f":"IF($B46=\"\",\"\",IFERROR(VLOOKUP($O46&\"|\"&$D46,UOM_Conversions!$A$2:$E$50,4,FALSE),\"CHECK UNIT\"))","v":""},{"$f":"IF($B46=\"\",\"\",IFERROR(INDEX(Ingredients_DB!$M$2:$M$501, MATCH($B46, Ingredients_DB!$B$2:$B$501,0)),0))","v":""},{"$f":"IF($B46=\"\",\"\",IFERROR(INDEX(Ingredients_DB!$N$2:$N$501, MATCH($B46, Ingredients_DB!$B$2:$B$501,0)),0))","v":""},{"$f":"IF($B46=\"\",\"\",IFERROR(INDEX(Ingredients_DB!$O$2:$O$501, MATCH($B46, Ingredients_DB!$B$2:$B$501,0)),0))","v":""},{"$f":"IF($B46=\"\",\"\",IFERROR(INDEX(Ingredients_DB!$P$2:$P$501, MATCH($B46, Ingredients_DB!$B$2:$B$501,0)),0))","v":""},{"$f":"IF($B46=\"\",\"\",IFERROR(INDEX(Ingredients_DB!$Q$2:$Q$501, MATCH($B46, Ingredients_DB!$B$2:$B$501,0)),0))","v":""},{"$f":"IF($B46=\"\",\"\",IFERROR(INDEX(Ingredients_DB!$R$2:$R$501, MATCH($B46, Ingredients_DB!$B$2:$B$501,0)),0))","v":""},{"$f":"IF($B46=\"\",\"\",IFERROR(INDEX(Ingredients_DB!$S$2:$S$501, MATCH($B46, Ingredients_DB!$B$2:$B$501,0)),0))","v":""},{"$f":"IF($B46=\"\",\"\",IFERROR(INDEX(Ingredients_DB!$T$2:$T$501, MATCH($B46, Ingredients_DB!$B$2:$B$501,0)),0))","v":""},{"$f":"IF($B46=\"\",\"\",IFERROR(INDEX(Ingredients_DB!$U$2:$U$501, MATCH($B46, Ingredients_DB!$B$2:$B$501,0)),0))","v":""},{"$f":"IF($B46=\"\",\"\",IFERROR(INDEX(Ingredients_DB!$V$2:$V$501, MATCH($B46, Ingredients_DB!$B$2:$B$501,0)),0))","v":""},{"$f":"IF($B46=\"\",\"\",IFERROR(INDEX(Ingredients_DB!$W$2:$W$501, MATCH($B46, Ingredients_DB!$B$2:$B$501,0)),0))","v":""},{"$f":"IF($B46=\"\",\"\",IFERROR(INDEX(Ingredients_DB!$X$2:$X$501, MATCH($B46, Ingredients_DB!$B$2:$B$501,0)),0))","v":""},{"$f":"IF($B46=\"\",\"\",IFERROR(INDEX(Ingredients_DB!$Y$2:$Y$501, MATCH($B46, Ingredients_DB!$B$2:$B$501,0)),0))","v":""},{"$f":"IF($B46=\"\",\"\",IFERROR(INDEX(Ingredients_DB!$Z$2:$Z$501, MATCH($B46, Ingredients_DB!$B$2:$B$501,0)),0))","v":""}]
[27,null,{"v":0,"d":"0.00"},"g",null,"",{"$f":"IF($B47=\"\",\"\",IFERROR(INDEX(Ingredients_DB!$K$2:$K$501, MATCH($B47, Ingredients_DB!$B$2:$B$501,0)),0))","v":""},"",{"$nulls":6},{"$f":"IF($B47=\"\",\"\",IFERROR(INDEX(Ingredients_DB!$H$2:$H$501, MATCH($B47, Ingredients_DB!$B$2:$B$501,0)),\"\"))","v":""},{"$f":"IF($B47=\"\",\"\",IFERROR(INDEX(Ingredients_DB!$I$2:$I$501, MATCH($B47, Ingredients_DB!$B$2:$B$501,0)),\"\"))","v":""},{"$f":"IF($B47=\"\",\"\",IFERROR(VLOOKUP($O47&\"|\"&$D47,UOM_Conversions!$A$2:$E$50,4,FALSE),\"CHECK UNIT\"))","v":""},{"$f":"IF($B47=\"\",\"\",IFERROR(INDEX(Ingredients_DB!$M$2:$M$501, MATCH($B47, Ingredients_DB!$B$2:$B$501,0)),0))","v":""},{"$f":"IF($B47=\"\",\"\",IFERROR(INDEX(Ingredients_DB!$N$2:$N$501, MATCH($B47, Ingredients_DB!$B$2:$B$501,0)),0))","v":""},{"$f":"IF($B47=\"\",\"\",IFERROR(INDEX(Ingredients_DB!$O$2:$O$501, MATCH($B47, Ingredients_DB!$B$2:$B$501,0)),0))","v":""},{"$f":"IF($B47=\"\",\"\",IFERROR(INDEX(Ingredients_DB!$P$2:$P$501, MATCH($B47, Ingredients_DB!$B$2:$B$501,0)),0))","v":""},{"$f":"IF($B47=\"\",\"\",IFERROR(INDEX(Ingredients_DB!$Q$2:$Q$501, MATCH($B47, Ingredients_DB!$B$2:$B$501,0)),0))","v":""},{"$f":"IF($B47=\"\",\"\",IFERROR(INDEX(Ingredients_DB!$R$2:$R$501, MATCH($B47, Ingredients_DB!$B$2:$B$501,0)),0))","v":""},{"$f":"IF($B47=\"\",\"\",IFERROR(INDEX(Ingredients_DB!$S$2:$S$501, MATCH($B47, Ingredients_DB!$B$2:$B$501,0)),0))","v":""},{"$f":"IF($B47=\"\",\"\",IFERROR(INDEX(Ingredients_DB!$T$2:$T$501, MATCH($B47, Ingredients_DB!$B$2:$B$501,0)),0))","v":""},{"$f":"IF($B47=\"\",\"\",IFERROR(INDEX(Ingredients_DB!$U$2:$U$501, MATCH($B47, Ingredients_DB!$B$2:$B$501,0)),0))","v":""},{"$f":"IF($B47=\"\",\"\",IFERROR(INDEX(Ingredients_DB!$V$2:$V$501, MATCH($B47, Ingredients_DB!$B$2:$B$501,0)),0))","v":""},{"$f":"IF($B47=\"\",\"\",IFERROR(INDEX(Ingredients_DB!$W$2:$W$501, MATCH($B47, Ingredients_DB!$B$2:$B$501,0)),0))","v":""},{"$f":"IF($B47=\"\",\"\",IFERROR(INDEX(Ingredients_DB!$X$2:$X$501, MATCH($B47, Ingredients_DB!$B$2:$B$501,0)),0))","v":""},{"$f":"IF($B47=\"\",\"\",IFERROR(INDEX(Ingredients_DB!$Y$2:$Y$501, MATCH($B47, Ingredients_DB!$B$2:$B$501,0)),0))","v":""},{"$f":"IF($B47=\"\",\"\",IFERROR(INDEX(Ingredients_DB!$Z$2:$Z$501, MATCH($B47, Ingredients_DB!$B$2:$B$501,0)),0))","v":""}]
[28,null,{"v":0,"d":"0.00"},"g",null,"",{"$f":"IF($B48=\"\",\"\",IFERROR(INDEX(Ingredients_DB!$K$2:$K$501, MATCH($B48, Ingredients_DB!$B$2:$B$501,0)),0))","v":""},"",{"$nulls":6},{"$f":"IF($B48=\"\",\"\",IFERROR(INDEX(Ingredients_DB!$H$2:$H$501, MATCH($B48, Ingredients_DB!$B$2:$B$501,0)),\"\"))","v":""},{"$f":"IF($B48=\"\",\"\",IFERROR(INDEX(Ingredients_DB!$I$2:$I$501, MATCH($B48, Ingredients_DB!$B$2:$B$501,0)),\"\"))","v":""},{"$f":"IF($B48=\"\",\"\",IFERROR(VLOOKUP($O48&\"|\"&$D48,UOM_Conversions!$A$2:$E$50,4,FALSE),\"CHECK UNIT\"))","v":""},{"$f":"IF($B48=\"\",\"\",IFERROR(INDEX(Ingredients_DB!$M$2:$M$501, MATCH($B48, Ingredients_DB!$B$2:$B$501,0)),0))","v":""},{"$f":"IF($B48=\"\",\"\",IFERROR(INDEX(Ingredients_DB!$N$2:$N$501, MATCH($B48, Ingredients_DB!$B$2:$B$501,0)),0))","v":""},{"$f":"IF($B48=\"\",\"\",IFERROR(INDEX(Ingredients_DB!$O$2:$O$501, MATCH($B48, Ingredients_DB!$B$2:$B$501,0)),0))","v":""},{"$f":"IF($B48=\"\",\"\",IFERROR(INDEX(Ingredients_DB!$P$2:$P$501, MATCH($B48, Ingredients_DB!$B$2:$B$501,0)),0))","v":""},{"$f":"IF($B48=\"\",\"\",IFERROR(INDEX(Ingredients_DB!$Q$2:$Q$501, MATCH($B48, Ingredients_DB!$B$2:$B$501,0)),0))","v":""},{"$f":"IF($B48=\"\",\"\",IFERROR(INDEX(Ingredients_DB!$R$2:$R$501, MATCH($B48, Ingredients_DB!$B$2:$B$501,0)),0))","v":""},{"$f":"IF($B48=\"\",\"\",IFERROR(INDEX(Ingredients_DB!$S$2:$S$501, MATCH($B48, Ingredients_DB!$B$2:$B$501,0)),0))","v":""},{"$f":"IF($B48=\"\",\"\",IFERROR(INDEX(Ingredients_DB!$T$2:$T$501, MATCH($B48, Ingredients_DB!$B$2:$B$501,0)),0))","v":""},{"$f":"IF($B48=\"\",\"\",IFERROR(INDEX(Ingredients_DB!$U$2:$U$501, MATCH($B48, Ingredients_DB!$B$2:$B$501,0)),0))","v":""},{"$f":"IF($B48=\"\",\"\",IFERROR(INDEX(Ingredients_DB!$V$2:$V$501, MATCH($B48, Ingredients_DB!$B$2:$B$501,0)),0))","v":""},{"$f":"IF($B48=\"\",\"\",IFERROR(INDEX(Ingredients_DB!$W$2:$W$501, MATCH($B48, Ingredients_DB!$B$2:$B$501,0)),0))","v":""},{"$f":"IF($B48=\"\",\"\",IFERROR(INDEX(Ingredients_DB!$X$2:$X$501, MATCH($B48, Ingredients_DB!$B$2:$B$501,0)),0))","v":""},{"$f":"IF($B48=\"\",\"\",IFERROR(INDEX(Ingredients_DB!$Y$2:$Y$501, MATCH($B48, Ingredients_DB!$B$2:$B$501,0)),0))","v":""},{"$f":"IF($B48=\"\",\"\",IFERROR(INDEX(Ingredients_DB!$Z$2:$Z$501, MATCH($B48, Ingredients_DB!$B$2:$B$501,0)),0))","v":""}]
[29,null,{"v":0,"d":"0.00"},"g",null,"",{"$f":"IF($B49=\"\",\"\",IFERROR(INDEX(Ingredients_DB!$K$2:$K$501, MATCH($B49, Ingredients_DB!$B$2:$B$501,0)),0))","v":""},"",{"$nulls":6},{"$f":"IF($B49=\"\",\"\",IFERROR(INDEX(Ingredients_DB!$H$2:$H$501, MATCH($B49, Ingredients_DB!$B$2:$B$501,0)),\"\"))","v":""},{"$f":"IF($B49=\"\",\"\",IFERROR(INDEX(Ingredients_DB!$I$2:$I$501, MATCH($B49, Ingredients_DB!$B$2:$B$501,0)),\"\"))","v":""},{"$f":"IF($B49=\"\",\"\",IFERROR(VLOOKUP($O49&\"|\"&$D49,UOM_Conversions!$A$2:$E$50,4,FALSE),\"CHECK UNIT\"))","v":""},{"$f":"IF($B49=\"\",\"\",IFERROR(INDEX(Ingredients_DB!$M$2:$M$501, MATCH($B49, Ingredients_DB!$B$2:$B$501,0)),0))","v":""},{"$f":"IF($B49=\"\",\"\",IFERROR(INDEX(Ingredients_DB!$N$2:$N$501, MATCH($B49, Ingredients_DB!$B$2:$B$501,0)),0))","v":""},{"$f":"IF($B49=\"\",\"\",IFERROR(INDEX(Ingredients_DB!$O$2:$O$501, MATCH($B49, Ingredients_DB!$B$2:$B$501,0)),0))","v":""},{"$f":"IF($B49=\"\",\"\",IFERROR(INDEX(Ingredients_DB!$P$2:$P$501, MATCH($B49, Ingredients_DB!$B$2:$B$501,0)),0))","v":""},{"$f":"IF($B49=\"\",\"\",IFERROR(INDEX(Ingredients_DB!$Q$2:$Q$501, MATCH($B49, Ingredients_DB!$B$2:$B$501,0)),0))","v":""},{"$f":"IF($B49=\"\",\"\",IFERROR(INDEX(Ingredients_DB!$R$2:$R$501, MATCH($B49, Ingredients_DB!$B$2:$B$501,0)),0))","v":""},{"$f":"IF($B49=\"\",\"\",IFERROR(INDEX(Ingredients_DB!$S$2:$S$501, MATCH($B49, Ingredients_DB!$B$2:$B$501,0)),0))","v":""},{"$f":"IF($B49=\"\",\"\",IFERROR(INDEX(Ingredients_DB!$T$2:$T$501, MATCH($B49, Ingredients_DB!$B$2:$B$501,0)),0))","v":""},{"$f":"IF($B49=\"\",\"\",IFERROR(INDEX(Ingredients_DB!$U$2:$U$501, MATCH($B49, Ingredients_DB!$B$2:$B$501,0)),0))","v":""},{"$f":"IF($B49=\"\",\"\",IFERROR(INDEX(Ingredients_DB!$V$2:$V$501, MATCH($B49, Ingredients_DB!$B$2:$B$501,0)),0))","v":""},{"$f":"IF($B49=\"\",\"\",IFERROR(INDEX(Ingredients_DB!$W$2:$W$501, MATCH($B49, Ingredients_DB!$B$2:$B$501,0)),0))","v":""},{"$f":"IF($B49=\"\",\"\",IFERROR(INDEX(Ingredients_DB!$X$2:$X$501, MATCH($B49, Ingredients_DB!$B$2:$B$501,0)),0))","v":""},{"$f":"IF($B49=\"\",\"\",IFERROR(INDEX(Ingredients_DB!$Y$2:$Y$501, MATCH($B49, Ingredients_DB!$B$2:$B$501,0)),0))","v":""},{"$f":"IF($B49=\"\",\"\",IFERROR(INDEX(Ingredients_DB!$Z$2:$Z$501, MATCH($B49, Ingredients_DB!$B$2:$B$501,0)),0))","v":""}]
[30,null,{"v":0,"d":"0.00"},"g",null,"",{"$f":"IF($B50=\"\",\"\",IFERROR(INDEX(Ingredients_DB!$K$2:$K$501, MATCH($B50, Ingredients_DB!$B$2:$B$501,0)),0))","v":""},"",{"$nulls":6},{"$f":"IF($B50=\"\",\"\",IFERROR(INDEX(Ingredients_DB!$H$2:$H$501, MATCH($B50, Ingredients_DB!$B$2:$B$501,0)),\"\"))","v":""},{"$f":"IF($B50=\"\",\"\",IFERROR(INDEX(Ingredients_DB!$I$2:$I$501, MATCH($B50, Ingredients_DB!$B$2:$B$501,0)),\"\"))","v":""},{"$f":"IF($B50=\"\",\"\",IFERROR(VLOOKUP($O50&\"|\"&$D50,UOM_Conversions!$A$2:$E$50,4,FALSE),\"CHECK UNIT\"))","v":""},{"$f":"IF($B50=\"\",\"\",IFERROR(INDEX(Ingredients_DB!$M$2:$M$501, MATCH($B50, Ingredients_DB!$B$2:$B$501,0)),0))","v":""},{"$f":"IF($B50=\"\",\"\",IFERROR(INDEX(Ingredients_DB!$N$2:$N$501, MATCH($B50, Ingredients_DB!$B$2:$B$501,0)),0))","v":""},{"$f":"IF($B50=\"\",\"\",IFERROR(INDEX(Ingredients_DB!$O$2:$O$501, MATCH($B50, Ingredients_DB!$B$2:$B$501,0)),0))","v":""},{"$f":"IF($B50=\"\",\"\",IFERROR(INDEX(Ingredients_DB!$P$2:$P$501, MATCH($B50, Ingredients_DB!$B$2:$B$501,0)),0))","v":""},{"$f":"IF($B50=\"\",\"\",IFERROR(INDEX(Ingredients_DB!$Q$2:$Q$501, MATCH($B50, Ingredients_DB!$B$2:$B$501,0)),0))","v":""},{"$f":"IF($B50=\"\",\"\",IFERROR(INDEX(Ingredients_DB!$R$2:$R$501, MATCH($B50, Ingredients_DB!$B$2:$B$501,0)),0))","v":""},{"$f":"IF($B50=\"\",\"\",IFERROR(INDEX(Ingredients_DB!$S$2:$S$501, MATCH($B50, Ingredients_DB!$B$2:$B$501,0)),0))","v":""},{"$f":"IF($B50=\"\",\"\",IFERROR(INDEX(Ingredients_DB!$T$2:$T$501, MATCH($B50, Ingredients_DB!$B$2:$B$501,0)),0))","v":""},{"$f":"IF($B50=\"\",\"\",IFERROR(INDEX(Ingredients_DB!$U$2:$U$501, MATCH($B50, Ingredients_DB!$B$2:$B$501,0)),0))","v":""},{"$f":"IF($B50=\"\",\"\",IFERROR(INDEX(Ingredients_DB!$V$2:$V$501, MATCH($B50, Ingredients_DB!$B$2:$B$501,0)),0))","v":""},{"$f":"IF($B50=\"\",\"\",IFERROR(INDEX(Ingredients_DB!$W$2:$W$501, MATCH($B50, Ingredients_DB!$B$2:$B$501,0)),0))","v":""},{"$f":"IF($B50=\"\",\"\",IFERROR(INDEX(Ingredients_DB!$X$2:$X$501, MATCH($B50, Ingredients_DB!$B$2:$B$501,0)),0))","v":""},{"$f":"IF($B50=\"\",\"\",IFERROR(INDEX(Ingredients_DB!$Y$2:$Y$501, MATCH($B50, Ingredients_DB!$B$2:$B$501,0)),0))","v":""},{"$f":"IF($B50=\"\",\"\",IFERROR(INDEX(Ingredients_DB!$Z$2:$Z$501, MATCH($B50, Ingredients_DB!$B$2:$B$501,0)),0))","v":""}]

{"sheet":"Example 2","index":6,"n_rows":50,"n_cols":31,"rows_kept":50,"merged":[[1,12,14,12],[19,10,49,12]]}
["RECIPE COST CARD",{"$nulls":9},"ALLERGEN SUMMARY (from ingredient flags)",{"$nulls":3},"For calculation (do not delete)"]
["Restaurant / Concept",null,"Demo Restaurant",null,"Last Updated","2026-02-02",{"$nulls":4},"Milk",{"$f":"IF(MAX(R21:R50)>0,\"YES\",\"\")","v":"YES"},"(e.g., gluten-free option? vegan? substitution guidance, allergen handling, etc.)"]
["Menu Item Name",null,"Example 2",{"$nulls":3},"Currency 1","Currency 2","Notes",null,"Egg",{"$f":"IF(MAX(S21:S50)>0,\"YES\",\"\")","v":"YES"}]
["Category",null,"Starter",null,"Total Batch Food Cost",null,{"$f":"IFERROR(SUM(H21:H50),0)","v":{"v":3.820921052631579,"d":"$3.82"}},null,"SUM(G21:G50)",null,"Fish",{"$f":"IF(MAX(T21:T50)>0,\"YES\",\"\")","v":""}]
["Station",null,"Grill",null,"Other Costs (packaging etc.)",{"$nulls":3},"IFERROR(SUM($G$14:$G$17),0)",null,"Shellfish",{"$f":"IF(MAX(U21:U50)>0,\"YES\",\"\")","v":""}]
["Batch Yield (portions)",null,1,null,"Total Batch Cost",null,{"$f":"G4+G5","v":{"v":3.820921052631579,"d":"$3.82"}},{"$nulls":3},"Molluscs",{"$f":"IF(MAX(V21:V50)>0,\"YES\",\"\")","v":""}]
["Portion Size",null,"1 burger + fries",null,"Cost / Portion",null,{"$f":"IFERROR(G6/$C$6,0)","v":{"v":3.820921052631579,"d":"$3.82"}},{"$nulls":3},"Peanuts",{"$f":"IF(MAX(W21:W50)>0,\"YES\",\"\")","v":""}]
["Selling Price / Portion",null,{"v":16,"d":"$16.00"},null,"Food Cost %",null,{"$f":"IFERROR(G7/$C$8,0)","v":{"v":0.23880756578947368,"d":"23.9%"}},{"$nulls":3},"Tree Nuts",{"$f":"IF(MAX(X21:X50)>0,\"YES\",\"\")","v":""}]
["Target Food Cost %",null,{"v":0.3,"d":"30.0%"},null,"Gross Profit / Portion",null,{"$f":"IFERROR($C$8-G7,0)","v":{"v":12.17907894736842,"d":"$12.18"}},{"$nulls":3},"Wheat/Gluten",{"$f":"IF(MAX(Y21:Y50)>0,\"YES\",\"\")","v":"YES"}]
["Prep Time (min)",null,10,null,"Gross Margin %",null,{"$f":"IFERROR(1-G8,0)","v":{"v":0.7611924342105263,"d":"76.1%"}},{"$nulls":3},"Soy",{"$f":"IF(MAX(Z21:Z50)>0,\"YES\",\"\")","v":"YES"}]
["Cook Time (min)",null,8,{"$nulls":7},"Sesame",{"$f":"IF(MAX(AA21:AA50)>0,\"YES\",\"\")","v":"YES"}]
["Shelf Life / Storage",null,"Hold cold 2 days; cook to order",null,"OTHER COSTS (not part of cost of sale in hotels and resorts)",{"$nulls":5},"Mustard",{"$f":"IF(MAX(AB21:AB50)>0,\"YES\",\"\")","v":""}]
[{"$nulls":4},"Description",null,"Cost",null,"Notes",null,"Celery",{"$f":"IF(MAX(AC21:AC50)>0,\"YES\",\"\")","v":""}]
[{"$nulls":4},"Packaging",null,{"v":0.25,"d":"$0.25"},{"$nulls":3},"Lupin",{"$f":"IF(MAX(AD21:AD50)>0,\"YES\",\"\")","v":""}]
[{"$nulls":4},"Napkin/condiment cup",null,{"v":0.1,"d":"$0.10"},{"$nulls":3},"Sulphites",{"$f":"IF(MAX(AE21:AE50)>0,\"YES\",\"\")","v":""}]
[{"$nulls":6},{"v":0,"d":"$0.00"}]
[{"$nulls":6},{"v":0,"d":"$0.00"}]
[]
["INGREDIENTS (enter Qty + Unit; costs auto-calc)",{"$nulls":4},"Actual Qty","Unit Cost",{"$nulls":3},"PREPARATION METHOD"]
["Line","Ingredient","Qty","Unit","Yield %","in base units","(per base)","Line Cost","Notes",null,"Step-by-step method - \n\ncritical control points - \n\nholding temps - \n\nplating - \n\ncross-contamination notes - "]
[1,"Beef mince",{"v":180,"d":"180.00"},"g",{"v":0.9,"d":"90%"},{"$f":"IF($B21=\"\",\"\",IF(ISNUMBER($Q21),$C21*$Q21/E21,\"\"))","v":{"v":200,"d":"200.00"}},{"$f":"IF($B21=\"\",\"\",IFERROR(INDEX(Ingredients_DB!$K$2:$K$501, MATCH($B21, Ingredients_DB!$B$2:$B$501,0)),0))","v":{"v":0.009,"d":"$0.01"}},{"$f":"IF($B21=\"\",\"\",IF(ISNUMBER($F21),$F21*$G21,\"\"))","v":{"v":1.7999999999999998,"d":"$1.80"}},"Patty 180g",{"$nulls":5},{"$f":"IF($B21=\"\",\"\",IFERROR(INDEX(Ingredients_DB!$H$2:$H$501, MATCH($B21, Ingredients_DB!$B$2:$B$501,0)),\"\"))","v":"Weight"},{"$f":"IF($B21=\"\",\"\",IFERROR(INDEX(Ingredients_DB!$I$2:$I$501, MATCH($B21, Ingredients_DB!$B$2:$B$501,0)),\"\"))","v":"g"},{"$f":"IF($B21=\"\",\"\",IFERROR(VLOOKUP($O21&\"|\"&$D21,UOM_Conversions!$A$2:$E$50,4,FALSE),\"CHECK UNIT\"))","v":1},{"$f":"IF($B21=\"\",\"\",IFERROR(INDEX(Ingredients_DB!$M$2:$M$501, MATCH($B21, Ingredients_DB!$B$2:$B$501,0)),0))","v":0},{"$f":"IF($B21=\"\",\"\",IFERROR(INDEX(Ingredients_DB!$N$2:$N$501, MATCH($B21, Ingredients_DB!$B$2:$B$501,0)),0))","v":0},{"$f":"IF($B21=\"\",\"\",IFERROR(INDEX(Ingredients_DB!$O$2:$O$501, MATCH($B21, Ingredients_DB!$B$2:$B$501,0)),0))","v":0},{"$f":"IF($B21=\"\",\"\",IFERROR(INDEX(Ingredients_DB!$P$2:$P$501, MATCH($B21, Ingredients_DB!$B$2:$B$501,0)),0))","v":0},{"$f":"IF($B21=\"\",\"\",IFERROR(INDEX(Ingredients_DB!$Q$2:$Q$501, MATCH($B21, Ingredients_DB!$B$2:$B$501,0)),0))","v":0},{"$f":"IF($B21=\"\",\"\",IFERROR(INDEX(Ingredients_DB!$R$2:$R$501, MATCH($B21, Ingredients_DB!$B$2:$B$501,0)),0))","v":0},{"$f":"IF($B21=\"\",\"\",IFERROR(INDEX(Ingredients_DB!$S$2:$S$501, MATCH($B21, Ingredients_DB!$B$2:$B$501,0)),0))","v":0},{"$f":"IF($B21=\"\",\"\",IFERROR(INDEX(Ingredients_DB!$T$2:$T$501, MATCH($B21, Ingredients_DB!$B$2:$B$501,0)),0))","v":0},{"$f":"IF($B21=\"\",\"\",IFERROR(INDEX(Ingredients_DB!$U$2:$U$501, MATCH($B21, Ingredients_DB!$B$2:$B$501,0)),0))","v":0},{"$f":"IF($B21=\"\",\"\",IFERROR(INDEX(Ingredients_DB!$V$2:$V$501, MATCH($B21, Ingredients_DB!$B$2:$B$501,0)),0))","v":0},{"$f":"IF($B21=\"\",\"\",IFERROR(INDEX(Ingredients_DB!$W$2:$W$501, MATCH($B21, Ingredients_DB!$B$2:$B$501,0)),0))","v":0},{"$f":"IF($B21=\"\",\"\",IFERROR(INDEX(Ingredients_DB!$X$2:$X$501, MATCH($B21, Ingredients_DB!$B$2:$B$501,0)),0))","v":0},{"$f":"IF($B21=\"\",\"\",IFERROR(INDEX(Ingredients_DB!$Y$2:$Y$501, MATCH($B21, Ingredients_DB!$B$2:$B$501,0)),0))","v":0},{"$f":"IF($B21=\"\",\"\",IFERROR(INDEX(Ingredients_DB!$Z$2:$Z$501, MATCH($B21, Ingredients_DB!$B$2:$B$501,0)),0))","v":0}]
[2,"Burger bun",{"v":1,"d":"1.00"},"each",{"v":1,"d":"100%"},{"v":1,"d":"1.00"},{"$f":"IF($B22=\"\",\"\",IFERROR(INDEX(Ingredients_DB!$K$2:$K$501, MATCH($B22, Ingredients_DB!$B$2:$B$501,0)),0))","v":{"v":0.75,"d":"$0.75"}},{"v":0.75,"d":"$0.75"},"Toasted",{"$nulls":5},{"$f":"IF($B22=\"\",\"\",IFERROR(INDEX(Ingredients_DB!$H$2:$H$501, MATCH($B22, Ingredients_DB!$B$2:$B$501,0)),\"\"))","v":"Each"},{"$f":"IF($B22=\"\",\"\",IFERROR(INDEX(Ingredients_DB!$I$2:$I$501, MATCH($B22, Ingredients_DB!$B$2:$B$501,0)),\"\"))","v":"each"},{"$f":"IF($B22=\"\",\"\",IFERROR(VLOOKUP($O22&\"|\"&$D22,UOM_Conversions!$A$2:$E$50,4,FALSE),\"CHECK UNIT\"))","v":1},{"$f":"IF($B22=\"\",\"\",IFERROR(INDEX(Ingredients_DB!$M$2:$M$501, MATCH($B22, Ingredients_DB!$B$2:$B$501,0)),0))","v":0},{"$f":"IF($B22=\"\",\"\",IFERROR(INDEX(Ingredients_DB!$N$2:$N$501, MATCH($B22, Ingredients_DB!$B$2:$B$501,0)),0))","v":0},{"$f":"IF($B22=\"\",\"\",IFERROR(INDEX(Ingredients_DB!$O$2:$O$501, MATCH($B22, Ingredients_DB!$B$2:$B$501,0)),0))","v":0},{"$f":"IF($B22=\"\",\"\",IFERROR(INDEX(Ingredients_DB!$P$2:$P$501, MATCH($B22, Ingredients_DB!$B$2:$B$501,0)),0))","v":0},{"$f":"IF($B22=\"\",\"\",IFERROR(INDEX(Ingredients_DB!$Q$2:$Q$501, MATCH($B22, Ingredients_DB!$B$2:$B$501,0)),0))","v":0},{"$f":"IF($B22=\"\",\"\",IFERROR(INDEX(Ingredients_DB!$R$2:$R$501, MATCH($B22, Ingredients_DB!$B$2:$B$501,0)),0))","v":0},{"$f":"IF($B22=\"\",\"\",IFERROR(INDEX(Ingredients_DB!$S$2:$S$501, MATCH($B22, Ingredients_DB!$B$2:$B$501,0)),0))","v":0},{"$f":"IF($B22=\"\",\"\",IFERROR(INDEX(Ingredients_DB!$T$2:$T$501, MATCH($B22, Ingredients_DB!$B$2:$B$501,0)),0))","v":1},{"$f":"IF($B22=\"\",\"\",IFERROR(INDEX(Ingredients_DB!$U$2:$U$501, MATCH($B22, Ingredients_DB!$B$2:$B$501,0)),0))","v":0},{"$f":"IF($B22=\"\",\"\",IFERROR(INDEX(Ingredients_DB!$V$2:$V$501, MATCH($B22, Ingredients_DB!$B$2:$B$501,0)),0))","v":0},{"$f":"IF($B22=\"\",\"\",IFERROR(INDEX(Ingredients_DB!$W$2:$W$501, MATCH($B22, Ingredients_DB!$B$2:$B$501,0)),0))","v":0},{"$f":"IF($B22=\"\",\"\",IFERROR(INDEX(Ingredients_DB!$X$2:$X$501, MATCH($B22, Ingredients_DB!$B$2:$B$501,0)),0))","v":0},{"$f":"IF($B22=\"\",\"\",IFERROR(INDEX(Ingredients_DB!$Y$2:$Y$501, MATCH($B22, Ingredients_DB!$B$2:$B$501,0)),0))","v":0},{"$f":"IF($B22=\"\",\"\",IFERROR(INDEX(Ingredients_DB!$Z$2:$Z$501, MATCH($B22, Ingredients_DB!$B$2:$B$501,0)),0))","v":0}]
[3,"Cheddar cheese",{"v":30,"d":"30.00"},"g",{"v":1,"d":"100%"},{"v":30,"d":"30.00"},{"$f":"IF($B23=\"\",\"\",IFERROR(INDEX(Ingredients_DB!$K$2:$K$501, MATCH($B23, Ingredients_DB!$B$2:$B$501,0)),0))","v":{"v":0.011,"d":"$0.01"}},{"v":0.32999999999999996,"d":"$0.33"},"Slice",{"$nulls":5},{"$f":"IF($B23=\"\",\"\",IFERROR(INDEX(Ingredients_DB!$H$2:$H$501, MATCH($B23, Ingredients_DB!$B$2:$B$501,0)),\"\"))","v":"Weight"},{"$f":"IF($B23=\"\",\"\",IFERROR(INDEX(Ingredients_DB!$I$2:$I$501, MATCH($B23, Ingredients_DB!$B$2:$B$501,0)),\"\"))","v":"g"},{"$f":"IF($B23=\"\",\"\",IFERROR(VLOOKUP($O23&\"|\"&$D23,UOM_Conversions!$A$2:$E$50,4,FALSE),\"CHECK UNIT\"))","v":1},{"$f":"IF($B23=\"\",\"\",IFERROR(INDEX(Ingredients_DB!$M$2:$M$501, MATCH($B23, Ingredients_DB!$B$2:$B$501,0)),0))","v":1},{"$f":"IF($B23=\"\",\"\",IFERROR(INDEX(Ingredients_DB!$N$2:$N$501, MATCH($B23, Ingredients_DB!$B$2:$B$501,0)),0))","v":0},{"$f":"IF($B23=\"\",\"\",IFERROR(INDEX(Ingredients_DB!$O$2:$O$501, MATCH($B23, Ingredients_DB!$B$2:$B$501,0)),0))","v":0},{"$f":"IF($B23=\"\",\"\",IFERROR(INDEX(Ingredients_DB!$P$2:$P$501, MATCH($B23, Ingredients_DB!$B$2:$B$501,0)),0))","v":0},{"$f":"IF($B23=\"\",\"\",IFERROR(INDEX(Ingredients_DB!$Q$2:$Q$501, MATCH($B23, Ingredients_DB!$B$2:$B$501,0)),0))","v":0},{"$f":"IF($B23=\"\",\"\",IFERROR(INDEX(Ingredients_DB!$R$2:$R$501, MATCH($B23, Ingredients_DB!$B$2:$B$501,0)),0))","v":0},{"$f":"IF($B23=\"\",\"\",IFERROR(INDEX(Ingredients_DB!$S$2:$S$501, MATCH($B23, Ingredients_DB!$B$2:$B$501,0)),0))","v":0},{"$f":"IF($B23=\"\",\"\",IFERROR(INDEX(Ingredients_DB!$T$2:$T$501, MATCH($B23, Ingredients_DB!$B$2:$B$501,0)),0))","v":0},{"$f":"IF($B23=\"\",\"\",IFERROR(INDEX(Ingredients_DB!$U$2:$U$501, MATCH($B23, Ingredients_DB!$B$2:$B$501,0)),0))","v":0},{"$f":"IF($B23=\"\",\"\",IFERROR(INDEX(Ingredients_DB!$V$2:$V$501, MATCH($B23, Ingredients_DB!$B$2:$B$501,0)),0))","v":0},{"$f":"IF($B23=\"\",\"\",IFERROR(INDEX(Ingredients_DB!$W$2:$W$501, MATCH($B23, Ingredients_DB!$B$2:$B$501,0)),0))","v":0},{"$f":"IF($B23=\"\",\"\",IFERROR(INDEX(Ingredients_DB!$X$2:$X$501, MATCH($B23, Ingredients_DB!$B$2:$B$501,0)),0))","v":0},{"$f":"IF($B23=\"\",\"\",IFERROR(INDEX(Ingredients_DB!$Y$2:$Y$501, MATCH($B23, Ingredients_DB!$B$2:$B$501,0)),0))","v":0},{"$f":"IF($B23=\"\",\"\",IFERROR(INDEX(Ingredients_DB!$Z$2:$Z$501, MATCH($B23, Ingredients_DB!$B$2:$B$501,0)),0))","v":0}]
[4,"Lettuce",{"v":20,"d":"20.00"},"g",{"v":0.95,"d":"95%"},{"v":21.05263157894737,"d":"21.05"},{"$f":"IF($B24=\"\",\"\",IFERROR(INDEX(Ingredients_DB!$K$2:$K$501, MATCH($B24, Ingredients_DB!$B$2:$B$501,0)),0))","v":{"v":0.008,"d":"$0.01"}},{"v":0.16842105263157897,"d":"$0.17"},"Shredded",{"$nulls":5},{"$f":"IF($B24=\"\",\"\",IFERROR(INDEX(Ingredients_DB!$H$2:$H$501, MATCH($B24, Ingredients_DB!$B$2:$B$501,0)),\"\"))","v":"Weight"},{"$f":"IF($B24=\"\",\"\",IFERROR(INDEX(Ingredients_DB!$I$2:$I$501, MATCH($B24, Ingredients_DB!$B$2:$B$501,0)),\"\"))","v":"g"},{"$f":"IF($B24=\"\",\"\",IFERROR(VLOOKUP($O24&\"|\"&$D24,UOM_Conversions!$A$2:$E$50,4,FALSE),\"CHECK UNIT\"))","v":1},{"$f":"IF($B24=\"\",\"\",IFERROR(INDEX(Ingredients_DB!$M$2:$M$501, MATCH($B24, Ingredients_DB!$B$2:$B$501,0)),0))","v":0},{"$f":"IF($B24=\"\",\"\",IFERROR(INDEX(Ingredients_DB!$N$2:$N$501, MATCH($B24, Ingredients_DB!$B$2:$B$501,0)),0))","v":0},{"$f":"IF($B24=\"\",\"\",IFERROR(INDEX(Ingredients_DB!$O$2:$O$501, MATCH($B24, Ingredients_DB!$B$2:$B$501,0)),0))","v":0},{"$f":"IF($B24=\"\",\"\",IFERROR(INDEX(Ingredients_DB!$P$2:$P$501, MATCH($B24, Ingredients_DB!$B$2:$B$501,0)),0))","v":0},{"$f":"IF($B24=\"\",\"\",IFERROR(INDEX(Ingredients_DB!$Q$2:$Q$501, MATCH($B24, Ingredients_DB!$B$2:$B$501,0)),0))","v":0},{"$f":"IF($B24=\"\",\"\",IFERROR(INDEX(Ingredients_DB!$R$2:$R$501, MATCH($B24, Ingredients_DB!$B$2:$B$501,0)),0))","v":0},{"$f":"IF($B24=\"\",\"\",IFERROR(INDEX(Ingredients_DB!$S$2:$S$501, MATCH($B24, Ingredients_DB!$B$2:$B$501,0)),0))","v":0},{"$f":"IF($B24=\"\",\"\",IFERROR(INDEX(Ingredients_DB!$T$2:$T$501, MATCH($B24, Ingredients_DB!$B$2:$B$501,0)),0))","v":0},{"$f":"IF($B24=\"\",\"\",IFERROR(INDEX(Ingredients_DB!$U$2:$U$501, MATCH($B24, Ingredients_DB!$B$2:$B$501,0)),0))","v":0},{"$f":"IF($B24=\"\",\"\",IFERROR(INDEX(Ingredients_DB!$V$2:$V$501, MATCH($B24, Ingredients_DB!$B$2:$B$501,0)),0))","v":0},{"$f":"IF($B24=\"\",\"\",IFERROR(INDEX(Ingredients_DB!$W$2:$W$501, MATCH($B24, Ingredients_DB!$B$2:$B$501,0)),0))","v":0},{"$f":"IF($B24=\"\",\"\",IFERROR(INDEX(Ingredients_DB!$X$2:$X$501, MATCH($B24, Ingredients_DB!$B$2:$B$501,0)),0))","v":0},{"$f":"IF($B24=\"\",\"\",IFERROR(INDEX(Ingredients_DB!$Y$2:$Y$501, MATCH($B24, Ingredients_DB!$B$2:$B$501,0)),0))","v":0},{"$f":"IF($B24=\"\",\"\",IFERROR(INDEX(Ingredients_DB!$Z$2:$Z$501, MATCH($B24, Ingredients_DB!$B$2:$B$501,0)),0))","v":0}]
[5,"Ketchup",{"v":20,"d":"20.00"},"g",{"v":1,"d":"100%"},{"v":20,"d":"20.00"},{"$f":"IF($B25=\"\",\"\",IFERROR(INDEX(Ingredients_DB!$K$2:$K$501, MATCH($B25, Ingredients_DB!$B$2:$B$501,0)),0))","v":{"v":0.004,"d":"$0.00"}},{"v":0.08,"d":"$0.08"},{"$nulls":6},{"$f":"IF($B25=\"\",\"\",IFERROR(INDEX(Ingredients_DB!$H$2:$H$501, MATCH($B25, Ingredients_DB!$B$2:$B$501,0)),\"\"))","v":"Weight"},{"$f":"IF($B25=\"\",\"\",IFERROR(INDEX(Ingredients_DB!$I$2:$I$501, MATCH($B25, Ingredients_DB!$B$2:$B$501,0)),\"\"))","v":"g"},{"$f":"IF($B25=\"\",\"\",IFERROR(VLOOKUP($O25&\"|\"&$D25,UOM_Conversions!$A$2:$E$50,4,FALSE),\"CHECK UNIT\"))","v":1},{"$f":"IF($B25=\"\",\"\",IFERROR(INDEX(Ingredients_DB!$M$2:$M$501, MATCH($B25, Ingredients_DB!$B$2:$B$501,0)),0))","v":0},{"$f":"IF($B25=\"\",\"\",IFERROR(INDEX(Ingredients_DB!$N$2:$N$501, MATCH($B25, Ingredients_DB!$B$2:$B$501,0)),0))","v":0},{"$f":"IF($B25=\"\",\"\",IFERROR(INDEX(Ingredients_DB!$O$2:$O$501, MATCH($B25, Ingredients_DB!$B$2:$B$501,0)),0))","v":0},{"$f":"IF($B25=\"\",\"\",IFERROR(INDEX(Ingredients_DB!$P$2:$P$501, MATCH($B25, Ingredients_DB!$B$2:$B$501,0)),0))","v":0},{"$f":"IF($B25=\"\",\"\",IFERROR(INDEX(Ingredients_DB!$Q$2:$Q$501, MATCH($B25, Ingredients_DB!$B$2:$B$501,0)),0))","v":0},{"$f":"IF($B25=\"\",\"\",IFERROR(INDEX(Ingredients_DB!$R$2:$R$501, MATCH($B25, Ingredients_DB!$B$2:$B$501,0)),0))","v":0},{"$f":"IF($B25=\"\",\"\",IFERROR(INDEX(Ingredients_DB!$S$2:$S$501, MATCH($B25, Ingredients_DB!$B$2:$B$501,0)),0))","v":0},{"$f":"IF($B25=\"\",\"\",IFERROR(INDEX(Ingredients_DB!$T$2:$T$501, MATCH($B25, Ingredients_DB!$B$2:$B$501,0)),0))","v":0},{"$f":"IF($B25=\"\",\"\",IFERROR(INDEX(Ingredients_DB!$U$2:$U$501, MATCH($B25, Ingredients_DB!$B$2:$B$501,0)),0))","v":0},{"$f":"IF($B25=\"\",\"\",IFERROR(INDEX(Ingredients_DB!$V$2:$V$501, MATCH($B25, Ingredients_DB!$B$2:$B$501,0)),0))","v":0},{"$f":"IF($B25=\"\",\"\",IFERROR(INDEX(Ingredients_DB!$W$2:$W$501, MATCH($B25, Ingredients_DB!$B$2:$B$501,0)),0))","v":0},{"$f":"IF($B25=\"\",\"\",IFERROR(INDEX(Ingredients_DB!$X$2:$X$501, MATCH($B25, Ingredients_DB!$B$2:$B$501,0)),0))","v":0},{"$f":"IF($B25=\"\",\"\",IFERROR(INDEX(Ingredients_DB!$Y$2:$Y$501, MATCH($B25, Ingredients_DB!$B$2:$B$501,0)),0))","v":0},{"$f":"IF($B25=\"\",\"\",IFERROR(INDEX(Ingredients_DB!$Z$2:$Z$501, MATCH($B25, Ingredients_DB!$B$2:$B$501,0)),0))","v":0}]
[6,"Mayonnaise",{"v":15,"d":"15.00"},"g",{"v":1,"d":"100%"},{"v":15,"d":"15.00"},{"$f":"IF($B26=\"\",\"\",IFERROR(INDEX(Ingredients_DB!$K$2:$K$501, MATCH($B26, Ingredients_DB!$B$2:$B$501,0)),0))","v":{"v":0.0075,"d":"$0.01"}},{"v":0.11249999999999999,"d":"$0.11"},{"$nulls":6},{"$f":"IF($B26=\"\",\"\",IFERROR(INDEX(Ingredients_DB!$H$2:$H$501, MATCH($B26, Ingredients_DB!$B$2:$B$501,0)),\"\"))","v":"Weight"},{"$f":"IF($B26=\"\",\"\",IFERROR(INDEX(Ingredients_DB!$I$2:$I$501, MATCH($B26, Ingredients_DB!$B$2:$B$501,0)),\"\"))","v":"g"},{"$f":"IF($B26=\"\",\"\",IFERROR(VLOOKUP($O26&\"|\"&$D26,UOM_Conversions!$A$2:$E$50,4,FALSE),\"CHECK UNIT\"))","v":1},{"$f":"IF($B26=\"\",\"\",IFERROR(INDEX(Ingredients_DB!$M$2:$M$501, MATCH($B26, Ingredients_DB!$B$2:$B$501,0)),0))","v":0},{"$f":"IF($B26=\"\",\"\",IFERROR(INDEX(Ingredients_DB!$N$2:$N$501, MATCH($B26, Ingredients_DB!$B$2:$B$501,0)),0))","v":1},{"$f":"IF($B26=\"\",\"\",IFERROR(INDEX(Ingredients_DB!$O$2:$O$501, MATCH($B26, Ingredients_DB!$B$2:$B$501,0)),0))","v":0},{"$f":"IF($B26=\"\",\"\",IFERROR(INDEX(Ingredients_DB!$P$2:$P$501, MATCH($B26, Ingredients_DB!$B$2:$B$501,0)),0))","v":0},{"$f":"IF($B26=\"\",\"\",IFERROR(INDEX(Ingredients_DB!$Q$2:$Q$501, MATCH($B26, Ingredients_DB!$B$2:$B$501,0)),0))","v":0},{"$f":"IF($B26=\"\",\"\",IFERROR(INDEX(Ingredients_DB!$R$2:$R$501, MATCH($B26, Ingredients_DB!$B$2:$B$501,0)),0))","v":0},{"$f":"IF($B26=\"\",\"\",IFERROR(INDEX(Ingredients_DB!$S$2:$S$501, MATCH($B26, Ingredients_DB!$B$2:$B$501,0)),0))","v":0},{"$f":"IF($B26=\"\",\"\",IFERROR(INDEX(Ingredients_DB!$T$2:$T$501, MATCH($B26, Ingredients_DB!$B$2:$B$501,0)),0))","v":0},{"$f":"IF($B26=\"\",\"\",IFERROR(INDEX(Ingredients_DB!$U$2:$U$501, MATCH($B26, Ingredients_DB!$B$2:$B$501,0)),0))","v":1},{"$f":"IF($B26=\"\",\"\",IFERROR(INDEX(Ingredients_DB!$V$2:$V$501, MATCH($B26, Ingredients_DB!$B$2:$B$501,0)),0))","v":0},{"$f":"IF($B26=\"\",\"\",IFERROR(INDEX(Ingredients_DB!$W$2:$W$501, MATCH($B26, Ingredients_DB!$B$2:$B$501,0)),0))","v":0},{"$f":"IF($B26=\"\",\"\",IFERROR(INDEX(Ingredients_DB!$X$2:$X$501, MATCH($B26, Ingredients_DB!$B$2:$B$501,0)),0))","v":0},{"$f":"IF($B26=\"\",\"\",IFERROR(INDEX(Ingredients_DB!$Y$2:$Y$501, MATCH($B26, Ingredients_DB!$B$2:$B$501,0)),0))","v":0},{"$f":"IF($B26=\"\",\"\",IFERROR(INDEX(Ingredients_DB!$Z$2:$Z$501, MATCH($B26, Ingredients_DB!$B$2:$B$501,0)),0))","v":0}]
[7,"French fries (frozen)",{"v":200,"d":"200.00"},"g",{"v":1,"d":"100%"},{"v":200,"d":"200.00"},{"$f":"IF($B27=\"\",\"\",IFERROR(INDEX(Ingredients_DB!$K$2:$K$501, MATCH($B27, Ingredients_DB!$B$2:$B$501,0)),0))","v":{"v":2.8E-3,"d":"$0.00"}},{"v":0.5599999999999999,"d":"$0.56"},"Portion",{"$nulls":5},{"$f":"IF($B27=\"\",\"\",IFERROR(INDEX(Ingredients_DB!$H$2:$H$501, MATCH($B27, Ingredients_DB!$B$2:$B$501,0)),\"\"))","v":"Weight"},{"$f":"IF($B27=\"\",\"\",IFERROR(INDEX(Ingredients_DB!$I$2:$I$501, MATCH($B27, Ingredients_DB!$B$2:$B$501,0)),\"\"))","v":"g"},{"$f":"IF($B27=\"\",\"\",IFERROR(VLOOKUP($O27&\"|\"&$D27,UOM_Conversions!$A$2:$E$50,4,FALSE),\"CHECK UNIT\"))","v":1},{"$f":"IF($B27=\"\",\"\",IFERROR(INDEX(Ingredients_DB!$M$2:$M$501, MATCH($B27, Ingredients_DB!$B$2:$B$501,0)),0))","v":0},{"$f":"IF($B27=\"\",\"\",IFERROR(INDEX(Ingredients_DB!$N$2:$N$501, MATCH($B27, Ingredients_DB!$B$2:$B$501,0)),0))","v":0},{"$f":"IF($B27=\"\",\"\",IFERROR(INDEX(Ingredients_DB!$O$2:$O$501, MATCH($B27, Ingredients_DB!$B$2:$B$501,0)),0))","v":0},{"$f":"IF($B27=\"\",\"\",IFERROR(INDEX(Ingredients_DB!$P$2:$P$501, MATCH($B27, Ingredients_DB!$B$2:$B$501,0)),0))","v":0},{"$f":"IF($B27=\"\",\"\",IFERROR(INDEX(Ingredients_DB!$Q$2:$Q$501, MATCH($B27, Ingredients_DB!$B$2:$B$501,0)),0))","v":0},{"$f":"IF($B27=\"\",\"\",IFERROR(INDEX(Ingredients_DB!$R$2:$R$501, MATCH($B27, Ingredients_DB!$B$2:$B$501,0)),0))","v":0},{"$f":"IF($B27=\"\",\"\",IFERROR(INDEX(Ingredients_DB!$S$2:$S$501, MATCH($B27, Ingredients_DB!$B$2:$B$501,0)),0))","v":0},{"$f":"IF($B27=\"\",\"\",IFERROR(INDEX(Ingredients_DB!$T$2:$T$501, MATCH($B27, Ingredients_DB!$B$2:$B$501,0)),0))","v":0},{"$f":"IF($B27=\"\",\"\",IFERROR(INDEX(Ingredients_DB!$U$2:$U$501, MATCH($B27, Ingredients_DB!$B$2:$B$501,0)),0))","v":0},{"$f":"IF($B27=\"\",\"\",IFERROR(INDEX(Ingredients_DB!$V$2:$V$501, MATCH($B27, Ingredients_DB!$B$2:$B$501,0)),0))","v":0},{"$f":"IF($B27=\"\",\"\",IFERROR(INDEX(Ingredients_DB!$W$2:$W$501, MATCH($B27, Ingredients_DB!$B$2:$B$501,0)),0))","v":0},{"$f":"IF($B27=\"\",\"\",IFERROR(INDEX(Ingredients_DB!$X$2:$X$501, MATCH($B27, Ingredients_DB!$B$2:$B$501,0)),0))","v":0},{"$f":"IF($B27=\"\",\"\",IFERROR(INDEX(Ingredients_DB!$Y$2:$Y$501, MATCH($B27, Ingredients_DB!$B$2:$B$501,0)),0))","v":0},{"$f":"IF($B27=\"\",\"\",IFERROR(INDEX(Ingredients_DB!$Z$2:$Z$501, MATCH($B27, Ingredients_DB!$B$2:$B$501,0)),0))","v":0}]
[8,"Sesame seeds",{"v":2,"d":"2.00"},"g",{"v":1,"d":"100%"},{"v":2,"d":"2.00"},{"$f":"IF($B28=\"\",\"\",IFERROR(INDEX(Ingredients_DB!$K$2:$K$501, MATCH($B28, Ingredients_DB!$B$2:$B$501,0)),0))","v":{"v":0.01,"d":"$0.01"}},{"v":0.02,"d":"$0.02"},"Bun topping (optional)",{"$nulls":5},{"$f":"IF($B28=\"\",\"\",IFERROR(INDEX(Ingredients_DB!$H$2:$H$501, MATCH($B28, Ingredients_DB!$B$2:$B$501,0)),\"\"))","v":"Weight"},{"$f":"IF($B28=\"\",\"\",IFERROR(INDEX(Ingredients_DB!$I$2:$I$501, MATCH($B28, Ingredients_DB!$B$2:$B$501,0)),\"\"))","v":"g"},{"$f":"IF($B28=\"\",\"\",IFERROR(VLOOKUP($O28&\"|\"&$D28,UOM_Conversions!$A$2:$E$50,4,FALSE),\"CHECK UNIT\"))","v":1},{"$f":"IF($B28=\"\",\"\",IFERROR(INDEX(Ingredients_DB!$M$2:$M$501, MATCH($B28, Ingredients_DB!$B$2:$B$501,0)),0))","v":0},{"$f":"IF($B28=\"\",\"\",IFERROR(INDEX(Ingredients_DB!$N$2:$N$501, MATCH($B28, Ingredients_DB!$B$2:$B$501,0)),0))","v":0},{"$f":"IF($B28=\"\",\"\",IFERROR(INDEX(Ingredients_DB!$O$2:$O$501, MATCH($B28, Ingredients_DB!$B$2:$B$501,0)),0))","v":0},{"$f":"IF($B28=\"\",\"\",IFERROR(INDEX(Ingredients_DB!$P$2:$P$501, MATCH($B28, Ingredients_DB!$B$2:$B$501,0)),0))","v":0},{"$f":"IF($B28=\"\",\"\",IFERROR(INDEX(Ingredients_DB!$Q$2:$Q$501, MATCH($B28, Ingredients_DB!$B$2:$B$501,0)),0))","v":0},{"$f":"IF($B28=\"\",\"\",IFERROR(INDEX(Ingredients_DB!$R$2:$R$501, MATCH($B28, Ingredients_DB!$B$2:$B$501,0)),0))","v":0},{"$f":"IF($B28=\"\",\"\",IFERROR(INDEX(Ingredients_DB!$S$2:$S$501, MATCH($B28, Ingredients_DB!$B$2:$B$501,0)),0))","v":0},{"$f":"IF($B28=\"\",\"\",IFERROR(INDEX(Ingredients_DB!$T$2:$T$501, MATCH($B28, Ingredients_DB!$B$2:$B$501,0)),0))","v":0},{"$f":"IF($B28=\"\",\"\",IFERROR(INDEX(Ingredients_DB!$U$2:$U$501, MATCH($B28, Ingredients_DB!$B$2:$B$501,0)),0))","v":0},{"$f":"IF($B28=\"\",\"\",IFERROR(INDEX(Ingredients_DB!$V$2:$V$501, MATCH($B28, Ingredients_DB!$B$2:$B$501,0)),0))","v":1},{"$f":"IF($B28=\"\",\"\",IFERROR(INDEX(Ingredients_DB!$W$2:$W$501, MATCH($B28, Ingredients_DB!$B$2:$B$501,0)),0))","v":0},{"$f":"IF($B28=\"\",\"\",IFERROR(INDEX(Ingredients_DB!$X$2:$X$501, MATCH($B28, Ingredients_DB!$B$2:$B$501,0)),0))","v":0},{"$f":"IF($B28=\"\",\"\",IFERROR(INDEX(Ingredients_DB!$Y$2:$Y$501, MATCH($B28, Ingredients_DB!$B$2:$B$501,0)),0))","v":0},{"$f":"IF($B28=\"\",\"\",IFERROR(INDEX(Ingredients_DB!$Z$2:$Z$501, MATCH($B28, Ingredients_DB!$B$2:$B$501,0)),0))","v":0}]
[9,null,{"v":0,"d":"0.00"},"g",null,"",{"$f":"IF($B29=\"\",\"\",IFERROR(INDEX(Ingredients_DB!$K$2:$K$501, MATCH($B29, Ingredients_DB!$B$2:$B$501,0)),0))","v":""},"",{"$nulls":6},{"$f":"IF($B29=\"\",\"\",IFERROR(INDEX(Ingredients_DB!$H$2:$H$501, MATCH($B29, Ingredients_DB!$B$2:$B$501,0)),\"\"))","v":""},{"$f":"IF($B29=\"\",\"\",IFERROR(INDEX(Ingredients_DB!$I$2:$I$501, MATCH($B29, Ingredients_DB!$B$2:$B$501,0)),\"\"))","v":""},{"$f":"IF($B29=\"\",\"\",IFERROR(VLOOKUP($O29&\"|\"&$D29,UOM_Conversions!$A$2:$E$50,4,FALSE),\"CHECK UNIT\"))","v":""},{"$f":"IF($B29=\"\",\"\",IFERROR(INDEX(Ingredients_DB!$M$2:$M$501, MATCH($B29, Ingredients_DB!$B$2:$B$501,0)),0))","v":""},{"$f":"IF($B29=\"\",\"\",IFERROR(INDEX(Ingredients_DB!$N$2:$N$501, MATCH($B29, Ingredients_DB!$B$2:$B$501,0)),0))","v":""},{"$f":"IF($B29=\"\",\"\",IFERROR(INDEX(Ingredients_DB!$O$2:$O$501, MATCH($B29, Ingredients_DB!$B$2:$B$501,0)),0))","v":""},{"$f":"IF($B29=\"\",\"\",IFERROR(INDEX(Ingredients_DB!$P$2:$P$501, MATCH($B29, Ingredients_DB!$B$2:$B$501,0)),0))","v":""},{"$f":"IF($B29=\"\",\"\",IFERROR(INDEX(Ingredients_DB!$Q$2:$Q$501, MATCH($B29, Ingredients_DB!$B$2:$B$501,0)),0))","v":""},{"$f":"IF($B29=\"\",\"\",IFERROR(INDEX(Ingredients_DB!$R$2:$R$501, MATCH($B29, Ingredients_DB!$B$2:$B$501,0)),0))","v":""},{"$f":"IF($B29=\"\",\"\",IFERROR(INDEX(Ingredients_DB!$S$2:$S$501, MATCH($B29, Ingredients_DB!$B$2:$B$501,0)),0))","v":""},{"$f":"IF($B29=\"\",\"\",IFERROR(INDEX(Ingredients_DB!$T$2:$T$501, MATCH($B29, Ingredients_DB!$B$2:$B$501,0)),0))","v":""},{"$f":"IF($B29=\"\",\"\",IFERROR(INDEX(Ingredients_DB!$U$2:$U$501, MATCH($B29, Ingredients_DB!$B$2:$B$501,0)),0))","v":""},{"$f":"IF($B29=\"\",\"\",IFERROR(INDEX(Ingredients_DB!$V$2:$V$501, MATCH($B29, Ingredients_DB!$B$2:$B$501,0)),0))","v":""},{"$f":"IF($B29=\"\",\"\",IFERROR(INDEX(Ingredients_DB!$W$2:$W$501, MATCH($B29, Ingredients_DB!$B$2:$B$501,0)),0))","v":""},{"$f":"IF($B29=\"\",\"\",IFERROR(INDEX(Ingredients_DB!$X$2:$X$501, MATCH($B29, Ingredients_DB!$B$2:$B$501,0)),0))","v":""},{"$f":"IF($B29=\"\",\"\",IFERROR(INDEX(Ingredients_DB!$Y$2:$Y$501, MATCH($B29, Ingredients_DB!$B$2:$B$501,0)),0))","v":""},{"$f":"IF($B29=\"\",\"\",IFERROR(INDEX(Ingredients_DB!$Z$2:$Z$501, MATCH($B29, Ingredients_DB!$B$2:$B$501,0)),0))","v":""}]
[10,null,{"v":0,"d":"0.00"},"g",null,"",{"$f":"IF($B30=\"\",\"\",IFERROR(INDEX(Ingredients_DB!$K$2:$K$501, MATCH($B30, Ingredients_DB!$B$2:$B$501,0)),0))","v":""},"",{"$nulls":6},{"$f":"IF($B30=\"\",\"\",IFERROR(INDEX(Ingredients_DB!$H$2:$H$501, MATCH($B30, Ingredients_DB!$B$2:$B$501,0)),\"\"))","v":""},{"$f":"IF($B30=\"\",\"\",IFERROR(INDEX(Ingredients_DB!$I$2:$I$501, MATCH($B30, Ingredients_DB!$B$2:$B$501,0)),\"\"))","v":""},{"$f":"IF($B30=\"\",\"\",IFERROR(VLOOKUP($O30&\"|\"&$D30,UOM_Conversions!$A$2:$E$50,4,FALSE),\"CHECK UNIT\"))","v":""},{"$f":"IF($B30=\"\",\"\",IFERROR(INDEX(Ingredients_DB!$M$2:$M$501, MATCH($B30, Ingredients_DB!$B$2:$B$501,0)),0))","v":""},{"$f":"IF($B30=\"\",\"\",IFERROR(INDEX(Ingredients_DB!$N$2:$N$501, MATCH($B30, Ingredients_DB!$B$2:$B$501,0)),0))","v":""},{"$f":"IF($B30=\"\",\"\",IFERROR(INDEX(Ingredients_DB!$O$2:$O$501, MATCH($B30, Ingredients_DB!$B$2:$B$501,0)),0))","v":""},{"$f":"IF($B30=\"\",\"\",IFERROR(INDEX(Ingredients_DB!$P$2:$P$501, MATCH($B30, Ingredients_DB!$B$2:$B$501,0)),0))","v":""},{"$f":"IF($B30=\"\",\"\",IFERROR(INDEX(Ingredients_DB!$Q$2:$Q$501, MATCH($B30, Ingredients_DB!$B$2:$B$501,0)),0))","v":""},{"$f":"IF($B30=\"\",\"\",IFERROR(INDEX(Ingredients_DB!$R$2:$R$501, MATCH($B30, Ingredients_DB!$B$2:$B$501,0)),0))","v":""},{"$f":"IF($B30=\"\",\"\",IFERROR(INDEX(Ingredients_DB!$S$2:$S$501, MATCH($B30, Ingredients_DB!$B$2:$B$501,0)),0))","v":""},{"$f":"IF($B30=\"\",\"\",IFERROR(INDEX(Ingredients_DB!$T$2:$T$501, MATCH($B30, Ingredients_DB!$B$2:$B$501,0)),0))","v":""},{"$f":"IF($B30=\"\",\"\",IFERROR(INDEX(Ingredients_DB!$U$2:$U$501, MATCH($B30, Ingredients_DB!$B$2:$B$501,0)),0))","v":""},{"$f":"IF($B30=\"\",\"\",IFERROR(INDEX(Ingredients_DB!$V$2:$V$501, MATCH($B30, Ingredients_DB!$B$2:$B$501,0)),0))","v":""},{"$f":"IF($B30=\"\",\"\",IFERROR(INDEX(Ingredients_DB!$W$2:$W$501, MATCH($B30, Ingredients_DB!$B$2:$B$501,0)),0))","v":""},{"$f":"IF($B30=\"\",\"\",IFERROR(INDEX(Ingredients_DB!$X$2:$X$501, MATCH($B30, Ingredients_DB!$B$2:$B$501,0)),0))","v":""},{"$f":"IF($B30=\"\",\"\",IFERROR(INDEX(Ingredients_DB!$Y$2:$Y$501, MATCH($B30, Ingredients_DB!$B$2:$B$501,0)),0))","v":""},{"$f":"IF($B30=\"\",\"\",IFERROR(INDEX(Ingredients_DB!$Z$2:$Z$501, MATCH($B30, Ingredients_DB!$B$2:$B$501,0)),0))","v":""}]
[11,null,{"v":0,"d":"0.00"},"g",null,"",{"$f":"IF($B31=\"\",\"\",IFERROR(INDEX(Ingredients_DB!$K$2:$K$501, MATCH($B31, Ingredients_DB!$B$2:$B$501,0)),0))","v":""},"",{"$nulls":6},{"$f":"IF($B31=\"\",\"\",IFERROR(INDEX(Ingredients_DB!$H$2:$H$501, MATCH($B31, Ingredients_DB!$B$2:$B$501,0)),\"\"))","v":""},{"$f":"IF($B31=\"\",\"\",IFERROR(INDEX(Ingredients_DB!$I$2:$I$501, MATCH($B31, Ingredients_DB!$B$2:$B$501,0)),\"\"))","v":""},{"$f":"IF($B31=\"\",\"\",IFERROR(VLOOKUP($O31&\"|\"&$D31,UOM_Conversions!$A$2:$E$50,4,FALSE),\"CHECK UNIT\"))","v":""},{"$f":"IF($B31=\"\",\"\",IFERROR(INDEX(Ingredients_DB!$M$2:$M$501, MATCH($B31, Ingredients_DB!$B$2:$B$501,0)),0))","v":""},{"$f":"IF($B31=\"\",\"\",IFERROR(INDEX(Ingredients_DB!$N$2:$N$501, MATCH($B31, Ingredients_DB!$B$2:$B$501,0)),0))","v":""},{"$f":"IF($B31=\"\",\"\",IFERROR(INDEX(Ingredients_DB!$O$2:$O$501, MATCH($B31, Ingredients_DB!$B$2:$B$501,0)),0))","v":""},{"$f":"IF($B31=\"\",\"\",IFERROR(INDEX(Ingredients_DB!$P$2:$P$501, MATCH($B31, Ingredients_DB!$B$2:$B$501,0)),0))","v":""},{"$f":"IF($B31=\"\",\"\",IFERROR(INDEX(Ingredients_DB!$Q$2:$Q$501, MATCH($B31, Ingredients_DB!$B$2:$B$501,0)),0))","v":""},{"$f":"IF($B31=\"\",\"\",IFERROR(INDEX(Ingredients_DB!$R$2:$R$501, MATCH($B31, Ingredients_DB!$B$2:$B$501,0)),0))","v":""},{"$f":"IF($B31=\"\",\"\",IFERROR(INDEX(Ingredients_DB!$S$2:$S$501, MATCH($B31, Ingredients_DB!$B$2:$B$501,0)),0))","v":""},{"$f":"IF($B31=\"\",\"\",IFERROR(INDEX(Ingredients_DB!$T$2:$T$501, MATCH($B31, Ingredients_DB!$B$2:$B$501,0)),0))","v":""},{"$f":"IF($B31=\"\",\"\",IFERROR(INDEX(Ingredients_DB!$U$2:$U$501, MATCH($B31, Ingredients_DB!$B$2:$B$501,0)),0))","v":""},{"$f":"IF($B31=\"\",\"\",IFERROR(INDEX(Ingredients_DB!$V$2:$V$501, MATCH($B31, Ingredients_DB!$B$2:$B$501,0)),0))","v":""},{"$f":"IF($B31=\"\",\"\",IFERROR(INDEX(Ingredients_DB!$W$2:$W$501, MATCH($B31, Ingredients_DB!$B$2:$B$501,0)),0))","v":""},{"$f":"IF($B31=\"\",\"\",IFERROR(INDEX(Ingredients_DB!$X$2:$X$501, MATCH($B31, Ingredients_DB!$B$2:$B$501,0)),0))","v":""},{"$f":"IF($B31=\"\",\"\",IFERROR(INDEX(Ingredients_DB!$Y$2:$Y$501, MATCH($B31, Ingredients_DB!$B$2:$B$501,0)),0))","v":""},{"$f":"IF($B31=\"\",\"\",IFERROR(INDEX(Ingredients_DB!$Z$2:$Z$501, MATCH($B31, Ingredients_DB!$B$2:$B$501,0)),0))","v":""}]
[12,null,{"v":0,"d":"0.00"},"g",null,"",{"$f":"IF($B32=\"\",\"\",IFERROR(INDEX(Ingredients_DB!$K$2:$K$501, MATCH($B32, Ingredients_DB!$B$2:$B$501,0)),0))","v":""},"",{"$nulls":6},{"$f":"IF($B32=\"\",\"\",IFERROR(INDEX(Ingredients_DB!$H$2:$H$501, MATCH($B32, Ingredients_DB!$B$2:$B$501,0)),\"\"))","v":""},{"$f":"IF($B32=\"\",\"\",IFERROR(INDEX(Ingredients_DB!$I$2:$I$501, MATCH($B32, Ingredients_DB!$B$2:$B$501,0)),\"\"))","v":""},{"$f":"IF($B32=\"\",\"\",IFERROR(VLOOKUP($O32&\"|\"&$D32,UOM_Conversions!$A$2:$E$50,4,FALSE),\"CHECK UNIT\"))","v":""},{"$f":"IF($B32=\"\",\"\",IFERROR(INDEX(Ingredients_DB!$M$2:$M$501, MATCH($B32, Ingredients_DB!$B$2:$B$501,0)),0))","v":""},{"$f":"IF($B32=\"\",\"\",IFERROR(INDEX(Ingredients_DB!$N$2:$N$501, MATCH($B32, Ingredients_DB!$B$2:$B$501,0)),0))","v":""},{"$f":"IF($B32=\"\",\"\",IFERROR(INDEX(Ingredients_DB!$O$2:$O$501, MATCH($B32, Ingredients_DB!$B$2:$B$501,0)),0))","v":""},{"$f":"IF($B32=\"\",\"\",IFERROR(INDEX(Ingredients_DB!$P$2:$P$501, MATCH($B32, Ingredients_DB!$B$2:$B$501,0)),0))","v":""},{"$f":"IF($B32=\"\",\"\",IFERROR(INDEX(Ingredients_DB!$Q$2:$Q$501, MATCH($B32, Ingredients_DB!$B$2:$B$501,0)),0))","v":""},{"$f":"IF($B32=\"\",\"\",IFERROR(INDEX(Ingredients_DB!$R$2:$R$501, MATCH($B32, Ingredients_DB!$B$2:$B$501,0)),0))","v":""},{"$f":"IF($B32=\"\",\"\",IFERROR(INDEX(Ingredients_DB!$S$2:$S$501, MATCH($B32, Ingredients_DB!$B$2:$B$501,0)),0))","v":""},{"$f":"IF($B32=\"\",\"\",IFERROR(INDEX(Ingredients_DB!$T$2:$T$501, MATCH($B32, Ingredients_DB!$B$2:$B$501,0)),0))","v":""},{"$f":"IF($B32=\"\",\"\",IFERROR(INDEX(Ingredients_DB!$U$2:$U$501, MATCH($B32, Ingredients_DB!$B$2:$B$501,0)),0))","v":""},{"$f":"IF($B32=\"\",\"\",IFERROR(INDEX(Ingredients_DB!$V$2:$V$501, MATCH($B32, Ingredients_DB!$B$2:$B$501,0)),0))","v":""},{"$f":"IF($B32=\"\",\"\",IFERROR(INDEX(Ingredients_DB!$W$2:$W$501, MATCH($B32, Ingredients_DB!$B$2:$B$501,0)),0))","v":""},{"$f":"IF($B32=\"\",\"\",IFERROR(INDEX(Ingredients_DB!$X$2:$X$501, MATCH($B32, Ingredients_DB!$B$2:$B$501,0)),0))","v":""},{"$f":"IF($B32=\"\",\"\",IFERROR(INDEX(Ingredients_DB!$Y$2:$Y$501, MATCH($B32, Ingredients_DB!$B$2:$B$501,0)),0))","v":""},{"$f":"IF($B32=\"\",\"\",IFERROR(INDEX(Ingredients_DB!$Z$2:$Z$501, MATCH($B32, Ingredients_DB!$B$2:$B$501,0)),0))","v":""}]
[13,null,{"v":0,"d":"0.00"},"g",null,"",{"$f":"IF($B33=\"\",\"\",IFERROR(INDEX(Ingredients_DB!$K$2:$K$501, MATCH($B33, Ingredients_DB!$B$2:$B$501,0)),0))","v":""},"",{"$nulls":6},{"$f":"IF($B33=\"\",\"\",IFERROR(INDEX(Ingredients_DB!$H$2:$H$501, MATCH($B33, Ingredients_DB!$B$2:$B$501,0)),\"\"))","v":""},{"$f":"IF($B33=\"\",\"\",IFERROR(INDEX(Ingredients_DB!$I$2:$I$501, MATCH($B33, Ingredients_DB!$B$2:$B$501,0)),\"\"))","v":""},{"$f":"IF($B33=\"\",\"\",IFERROR(VLOOKUP($O33&\"|\"&$D33,UOM_Conversions!$A$2:$E$50,4,FALSE),\"CHECK UNIT\"))","v":""},{"$f":"IF($B33=\"\",\"\",IFERROR(INDEX(Ingredients_DB!$M$2:$M$501, MATCH($B33, Ingredients_DB!$B$2:$B$501,0)),0))","v":""},{"$f":"IF($B33=\"\",\"\",IFERROR(INDEX(Ingredients_DB!$N$2:$N$501, MATCH($B33, Ingredients_DB!$B$2:$B$501,0)),0))","v":""},{"$f":"IF($B33=\"\",\"\",IFERROR(INDEX(Ingredients_DB!$O$2:$O$501, MATCH($B33, Ingredients_DB!$B$2:$B$501,0)),0))","v":""},{"$f":"IF($B33=\"\",\"\",IFERROR(INDEX(Ingredients_DB!$P$2:$P$501, MATCH($B33, Ingredients_DB!$B$2:$B$501,0)),0))","v":""},{"$f":"IF($B33=\"\",\"\",IFERROR(INDEX(Ingredients_DB!$Q$2:$Q$501, MATCH($B33, Ingredients_DB!$B$2:$B$501,0)),0))","v":""},{"$f":"IF($B33=\"\",\"\",IFERROR(INDEX(Ingredients_DB!$R$2:$R$501, MATCH($B33, Ingredients_DB!$B$2:$B$501,0)),0))","v":""},{"$f":"IF($B33=\"\",\"\",IFERROR(INDEX(Ingredients_DB!$S$2:$S$501, MATCH($B33, Ingredients_DB!$B$2:$B$501,0)),0))","v":""},{"$f":"IF($B33=\"\",\"\",IFERROR(INDEX(Ingredients_DB!$T$2:$T$501, MATCH($B33, Ingredients_DB!$B$2:$B$501,0)),0))","v":""},{"$f":"IF($B33=\"\",\"\",IFERROR(INDEX(Ingredients_DB!$U$2:$U$501, MATCH($B33, Ingredients_DB!$B$2:$B$501,0)),0))","v":""},{"$f":"IF($B33=\"\",\"\",IFERROR(INDEX(Ingredients_DB!$V$2:$V$501, MATCH($B33, Ingredients_DB!$B$2:$B$501,0)),0))","v":""},{"$f":"IF($B33=\"\",\"\",IFERROR(INDEX(Ingredients_DB!$W$2:$W$501, MATCH($B33, Ingredients_DB!$B$2:$B$501,0)),0))","v":""},{"$f":"IF($B33=\"\",\"\",IFERROR(INDEX(Ingredients_DB!$X$2:$X$501, MATCH($B33, Ingredients_DB!$B$2:$B$501,0)),0))","v":""},{"$f":"IF($B33=\"\",\"\",IFERROR(INDEX(Ingredients_DB!$Y$2:$Y$501, MATCH($B33, Ingredients_DB!$B$2:$B$501,0)),0))","v":""},{"$f":"IF($B33=\"\",\"\",IFERROR(INDEX(Ingredients_DB!$Z$2:$Z$501, MATCH($B33, Ingredients_DB!$B$2:$B$501,0)),0))","v":""}]
[14,null,{"v":0,"d":"0.00"},"g",null,"",{"$f":"IF($B34=\"\",\"\",IFERROR(INDEX(Ingredients_DB!$K$2:$K$501, MATCH($B34, Ingredients_DB!$B$2:$B$501,0)),0))","v":""},"",{"$nulls":6},{"$f":"IF($B34=\"\",\"\",IFERROR(INDEX(Ingredients_DB!$H$2:$H$501, MATCH($B34, Ingredients_DB!$B$2:$B$501,0)),\"\"))","v":""},{"$f":"IF($B34=\"\",\"\",IFERROR(INDEX(Ingredients_DB!$I$2:$I$501, MATCH($B34, Ingredients_DB!$B$2:$B$501,0)),\"\"))","v":""},{"$f":"IF($B34=\"\",\"\",IFERROR(VLOOKUP($O34&\"|\"&$D34,UOM_Conversions!$A$2:$E$50,4,FALSE),\"CHECK UNIT\"))","v":""},{"$f":"IF($B34=\"\",\"\",IFERROR(INDEX(Ingredients_DB!$M$2:$M$501, MATCH($B34, Ingredients_DB!$B$2:$B$501,0)),0))","v":""},{"$f":"IF($B34=\"\",\"\",IFERROR(INDEX(Ingredients_DB!$N$2:$N$501, MATCH($B34, Ingredients_DB!$B$2:$B$501,0)),0))","v":""},{"$f":"IF($B34=\"\",\"\",IFERROR(INDEX(Ingredients_DB!$O$2:$O$501, MATCH($B34, Ingredients_DB!$B$2:$B$501,0)),0))","v":""},{"$f":"IF($B34=\"\",\"\",IFERROR(INDEX(Ingredients_DB!$P$2:$P$501, MATCH($B34, Ingredients_DB!$B$2:$B$501,0)),0))","v":""},{"$f":"IF($B34=\"\",\"\",IFERROR(INDEX(Ingredients_DB!$Q$2:$Q$501, MATCH($B34, Ingredients_DB!$B$2:$B$501,0)),0))","v":""},{"$f":"IF($B34=\"\",\"\",IFERROR(INDEX(Ingredients_DB!$R$2:$R$501, MATCH($B34, Ingredients_DB!$B$2:$B$501,0)),0))","v":""},{"$f":"IF($B34=\"\",\"\",IFERROR(INDEX(Ingredients_DB!$S$2:$S$501, MATCH($B34, Ingredients_DB!$B$2:$B$501,0)),0))","v":""},{"$f":"IF($B34=\"\",\"\",IFERROR(INDEX(Ingredients_DB!$T$2:$T$501, MATCH($B34, Ingredients_DB!$B$2:$B$501,0)),0))","v":""},{"$f":"IF($B34=\"\",\"\",IFERROR(INDEX(Ingredients_DB!$U$2:$U$501, MATCH($B34, Ingredients_DB!$B$2:$B$501,0)),0))","v":""},{"$f":"IF($B34=\"\",\"\",IFERROR(INDEX(Ingredients_DB!$V$2:$V$501, MATCH($B34, Ingredients_DB!$B$2:$B$501,0)),0))","v":""},{"$f":"IF($B34=\"\",\"\",IFERROR(INDEX(Ingredients_DB!$W$2:$W$501, MATCH($B34, Ingredients_DB!$B$2:$B$501,0)),0))","v":""},{"$f":"IF($B34=\"\",\"\",IFERROR(INDEX(Ingredients_DB!$X$2:$X$501, MATCH($B34, Ingredients_DB!$B$2:$B$501,0)),0))","v":""},{"$f":"IF($B34=\"\",\"\",IFERROR(INDEX(Ingredients_DB!$Y$2:$Y$501, MATCH($B34, Ingredients_DB!$B$2:$B$501,0)),0))","v":""},{"$f":"IF($B34=\"\",\"\",IFERROR(INDEX(Ingredients_DB!$Z$2:$Z$501, MATCH($B34, Ingredients_DB!$B$2:$B$501,0)),0))","v":""}]
[15,null,{"v":0,"d":"0.00"},"g",null,"",{"$f":"IF($B35=\"\",\"\",IFERROR(INDEX(Ingredients_DB!$K$2:$K$501, MATCH($B35, Ingredients_DB!$B$2:$B$501,0)),0))","v":""},"",{"$nulls":6},{"$f":"IF($B35=\"\",\"\",IFERROR(INDEX(Ingredients_DB!$H$2:$H$501, MATCH($B35, Ingredients_DB!$B$2:$B$501,0)),\"\"))","v":""},{"$f":"IF($B35=\"\",\"\",IFERROR(INDEX(Ingredients_DB!$I$2:$I$501, MATCH($B35, Ingredients_DB!$B$2:$B$501,0)),\"\"))","v":""},{"$f":"IF($B35=\"\",\"\",IFERROR(VLOOKUP($O35&\"|\"&$D35,UOM_Conversions!$A$2:$E$50,4,FALSE),\"CHECK UNIT\"))","v":""},{"$f":"IF($B35=\"\",\"\",IFERROR(INDEX(Ingredients_DB!$M$2:$M$501, MATCH($B35, Ingredients_DB!$B$2:$B$501,0)),0))","v":""},{"$f":"IF($B35=\"\",\"\",IFERROR(INDEX(Ingredients_DB!$N$2:$N$501, MATCH($B35, Ingredients_DB!$B$2:$B$501,0)),0))","v":""},{"$f":"IF($B35=\"\",\"\",IFERROR(INDEX(Ingredients_DB!$O$2:$O$501, MATCH($B35, Ingredients_DB!$B$2:$B$501,0)),0))","v":""},{"$f":"IF($B35=\"\",\"\",IFERROR(INDEX(Ingredients_DB!$P$2:$P$501, MATCH($B35, Ingredients_DB!$B$2:$B$501,0)),0))","v":""},{"$f":"IF($B35=\"\",\"\",IFERROR(INDEX(Ingredients_DB!$Q$2:$Q$501, MATCH($B35, Ingredients_DB!$B$2:$B$501,0)),0))","v":""},{"$f":"IF($B35=\"\",\"\",IFERROR(INDEX(Ingredients_DB!$R$2:$R$501, MATCH($B35, Ingredients_DB!$B$2:$B$501,0)),0))","v":""},{"$f":"IF($B35=\"\",\"\",IFERROR(INDEX(Ingredients_DB!$S$2:$S$501, MATCH($B35, Ingredients_DB!$B$2:$B$501,0)),0))","v":""},{"$f":"IF($B35=\"\",\"\",IFERROR(INDEX(Ingredients_DB!$T$2:$T$501, MATCH($B35, Ingredients_DB!$B$2:$B$501,0)),0))","v":""},{"$f":"IF($B35=\"\",\"\",IFERROR(INDEX(Ingredients_DB!$U$2:$U$501, MATCH($B35, Ingredients_DB!$B$2:$B$501,0)),0))","v":""},{"$f":"IF($B35=\"\",\"\",IFERROR(INDEX(Ingredients_DB!$V$2:$V$501, MATCH($B35, Ingredients_DB!$B$2:$B$501,0)),0))","v":""},{"$f":"IF($B35=\"\",\"\",IFERROR(INDEX(Ingredients_DB!$W$2:$W$501, MATCH($B35, Ingredients_DB!$B$2:$B$501,0)),0))","v":""},{"$f":"IF($B35=\"\",\"\",IFERROR(INDEX(Ingredients_DB!$X$2:$X$501, MATCH($B35, Ingredients_DB!$B$2:$B$501,0)),0))","v":""},{"$f":"IF($B35=\"\",\"\",IFERROR(INDEX(Ingredients_DB!$Y$2:$Y$501, MATCH($B35, Ingredients_DB!$B$2:$B$501,0)),0))","v":""},{"$f":"IF($B35=\"\",\"\",IFERROR(INDEX(Ingredients_DB!$Z$2:$Z$501, MATCH($B35, Ingredients_DB!$B$2:$B$501,0)),0))","v":""}]
[16,null,{"v":0,"d":"0.00"},"g",null,"",{"$f":"IF($B36=\"\",\"\",IFERROR(INDEX(Ingredients_DB!$K$2:$K$501, MATCH($B36, Ingredients_DB!$B$2:$B$501,0)),0))","v":""},"",{"$nulls":6},{"$f":"IF($B36=\"\",\"\",IFERROR(INDEX(Ingredients_DB!$H$2:$H$501, MATCH($B36, Ingredients_DB!$B$2:$B$501,0)),\"\"))","v":""},{"$f":"IF($B36=\"\",\"\",IFERROR(INDEX(Ingredients_DB!$I$2:$I$501, MATCH($B36, Ingredients_DB!$B$2:$B$501,0)),\"\"))","v":""},{"$f":"IF($B36=\"\",\"\",IFERROR(VLOOKUP($O36&\"|\"&$D36,UOM_Conversions!$A$2:$E$50,4,FALSE),\"CHECK UNIT\"))","v":""},{"$f":"IF($B36=\"\",\"\",IFERROR(INDEX(Ingredients_DB!$M$2:$M$501, MATCH($B36, Ingredients_DB!$B$2:$B$501,0)),0))","v":""},{"$f":"IF($B36=\"\",\"\",IFERROR(INDEX(Ingredients_DB!$N$2:$N$501, MATCH($B36, Ingredients_DB!$B$2:$B$501,0)),0))","v":""},{"$f":"IF($B36=\"\",\"\",IFERROR(INDEX(Ingredients_DB!$O$2:$O$501, MATCH($B36, Ingredients_DB!$B$2:$B$501,0)),0))","v":""},{"$f":"IF($B36=\"\",\"\",IFERROR(INDEX(Ingredients_DB!$P$2:$P$501, MATCH($B36, Ingredients_DB!$B$2:$B$501,0)),0))","v":""},{"$f":"IF($B36=\"\",\"\",IFERROR(INDEX(Ingredients_DB!$Q$2:$Q$501, MATCH($B36, Ingredients_DB!$B$2:$B$501,0)),0))","v":""},{"$f":"IF($B36=\"\",\"\",IFERROR(INDEX(Ingredients_DB!$R$2:$R$501, MATCH($B36, Ingredients_DB!$B$2:$B$501,0)),0))","v":""},{"$f":"IF($B36=\"\",\"\",IFERROR(INDEX(Ingredients_DB!$S$2:$S$501, MATCH($B36, Ingredients_DB!$B$2:$B$501,0)),0))","v":""},{"$f":"IF($B36=\"\",\"\",IFERROR(INDEX(Ingredients_DB!$T$2:$T$501, MATCH($B36, Ingredients_DB!$B$2:$B$501,0)),0))","v":""},{"$f":"IF($B36=\"\",\"\",IFERROR(INDEX(Ingredients_DB!$U$2:$U$501, MATCH($B36, Ingredients_DB!$B$2:$B$501,0)),0))","v":""},{"$f":"IF($B36=\"\",\"\",IFERROR(INDEX(Ingredients_DB!$V$2:$V$501, MATCH($B36, Ingredients_DB!$B$2:$B$501,0)),0))","v":""},{"$f":"IF($B36=\"\",\"\",IFERROR(INDEX(Ingredients_DB!$W$2:$W$501, MATCH($B36, Ingredients_DB!$B$2:$B$501,0)),0))","v":""},{"$f":"IF($B36=\"\",\"\",IFERROR(INDEX(Ingredients_DB!$X$2:$X$501, MATCH($B36, Ingredients_DB!$B$2:$B$501,0)),0))","v":""},{"$f":"IF($B36=\"\",\"\",IFERROR(INDEX(Ingredients_DB!$Y$2:$Y$501, MATCH($B36, Ingredients_DB!$B$2:$B$501,0)),0))","v":""},{"$f":"IF($B36=\"\",\"\",IFERROR(INDEX(Ingredients_DB!$Z$2:$Z$501, MATCH($B36, Ingredients_DB!$B$2:$B$501,0)),0))","v":""}]
[17,null,{"v":0,"d":"0.00"},"g",null,"",{"$f":"IF($B37=\"\",\"\",IFERROR(INDEX(Ingredients_DB!$K$2:$K$501, MATCH($B37, Ingredients_DB!$B$2:$B$501,0)),0))","v":""},"",{"$nulls":6},{"$f":"IF($B37=\"\",\"\",IFERROR(INDEX(Ingredients_DB!$H$2:$H$501, MATCH($B37, Ingredients_DB!$B$2:$B$501,0)),\"\"))","v":""},{"$f":"IF($B37=\"\",\"\",IFERROR(INDEX(Ingredients_DB!$I$2:$I$501, MATCH($B37, Ingredients_DB!$B$2:$B$501,0)),\"\"))","v":""},{"$f":"IF($B37=\"\",\"\",IFERROR(VLOOKUP($O37&\"|\"&$D37,UOM_Conversions!$A$2:$E$50,4,FALSE),\"CHECK UNIT\"))","v":""},{"$f":"IF($B37=\"\",\"\",IFERROR(INDEX(Ingredients_DB!$M$2:$M$501, MATCH($B37, Ingredients_DB!$B$2:$B$501,0)),0))","v":""},{"$f":"IF($B37=\"\",\"\",IFERROR(INDEX(Ingredients_DB!$N$2:$N$501, MATCH($B37, Ingredients_DB!$B$2:$B$501,0)),0))","v":""},{"$f":"IF($B37=\"\",\"\",IFERROR(INDEX(Ingredients_DB!$O$2:$O$501, MATCH($B37, Ingredients_DB!$B$2:$B$501,0)),0))","v":""},{"$f":"IF($B37=\"\",\"\",IFERROR(INDEX(Ingredients_DB!$P$2:$P$501, MATCH($B37, Ingredients_DB!$B$2:$B$501,0)),0))","v":""},{"$f":"IF($B37=\"\",\"\",IFERROR(INDEX(Ingredients_DB!$Q$2:$Q$501, MATCH($B37, Ingredients_DB!$B$2:$B$501,0)),0))","v":""},{"$f":"IF($B37=\"\",\"\",IFERROR(INDEX(Ingredients_DB!$R$2:$R$501, MATCH($B37, Ingredients_DB!$B$2:$B$501,0)),0))","v":""},{"$f":"IF($B37=\"\",\"\",IFERROR(INDEX(Ingredients_DB!$S$2:$S$501, MATCH($B37, Ingredients_DB!$B$2:$B$501,0)),0))","v":""},{"$f":"IF($B37=\"\",\"\",IFERROR(INDEX(Ingredients_DB!$T$2:$T$501, MATCH($B37, Ingredients_DB!$B$2:$B$501,0)),0))","v":""},{"$f":"IF($B37=\"\",\"\",IFERROR(INDEX(Ingredients_DB!$U$2:$U$501, MATCH($B37, Ingredients_DB!$B$2:$B$501,0)),0))","v":""},{"$f":"IF($B37=\"\",\"\",IFERROR(INDEX(Ingredients_DB!$V$2:$V$501, MATCH($B37, Ingredients_DB!$B$2:$B$501,0)),0))","v":""},{"$f":"IF($B37=\"\",\"\",IFERROR(INDEX(Ingredients_DB!$W$2:$W$501, MATCH($B37, Ingredients_DB!$B$2:$B$501,0)),0))","v":""},{"$f":"IF($B37=\"\",\"\",IFERROR(INDEX(Ingredients_DB!$X$2:$X$501, MATCH($B37, Ingredients_DB!$B$2:$B$501,0)),0))","v":""},{"$f":"IF($B37=\"\",\"\",IFERROR(INDEX(Ingredients_DB!$Y$2:$Y$501, MATCH($B37, Ingredients_DB!$B$2:$B$501,0)),0))","v":""},{"$f":"IF($B37=\"\",\"\",IFERROR(INDEX(Ingredients_DB!$Z$2:$Z$501, MATCH($B37, Ingredients_DB!$B$2:$B$501,0)),0))","v":""}]
[18,null,{"v":0,"d":"0.00"},"g",null,"",{"$f":"IF($B38=\"\",\"\",IFERROR(INDEX(Ingredients_DB!$K$2:$K$501, MATCH($B38, Ingredients_DB!$B$2:$B$501,0)),0))","v":""},"",{"$nulls":6},{"$f":"IF($B38=\"\",\"\",IFERROR(INDEX(Ingredients_DB!$H$2:$H$501, MATCH($B38, Ingredients_DB!$B$2:$B$501,0)),\"\"))","v":""},{"$f":"IF($B38=\"\",\"\",IFERROR(INDEX(Ingredients_DB!$I$2:$I$501, MATCH($B38, Ingredients_DB!$B$2:$B$501,0)),\"\"))","v":""},{"$f":"IF($B38=\"\",\"\",IFERROR(VLOOKUP($O38&\"|\"&$D38,UOM_Conversions!$A$2:$E$50,4,FALSE),\"CHECK UNIT\"))","v":""},{"$f":"IF($B38=\"\",\"\",IFERROR(INDEX(Ingredients_DB!$M$2:$M$501, MATCH($B38, Ingredients_DB!$B$2:$B$501,0)),0))","v":""},{"$f":"IF($B38=\"\",\"\",IFERROR(INDEX(Ingredients_DB!$N$2:$N$501, MATCH($B38, Ingredients_DB!$B$2:$B$501,0)),0))","v":""},{"$f":"IF($B38=\"\",\"\",IFERROR(INDEX(Ingredients_DB!$O$2:$O$501, MATCH($B38, Ingredients_DB!$B$2:$B$501,0)),0))","v":""},{"$f":"IF($B38=\"\",\"\",IFERROR(INDEX(Ingredients_DB!$P$2:$P$501, MATCH($B38, Ingredients_DB!$B$2:$B$501,0)),0))","v":""},{"$f":"IF($B38=\"\",\"\",IFERROR(INDEX(Ingredients_DB!$Q$2:$Q$501, MATCH($B38, Ingredients_DB!$B$2:$B$501,0)),0))","v":""},{"$f":"IF($B38=\"\",\"\",IFERROR(INDEX(Ingredients_DB!$R$2:$R$501, MATCH($B38, Ingredients_DB!$B$2:$B$501,0)),0))","v":""},{"$f":"IF($B38=\"\",\"\",IFERROR(INDEX(Ingredients_DB!$S$2:$S$501, MATCH($B38, Ingredients_DB!$B$2:$B$501,0)),0))","v":""},{"$f":"IF($B38=\"\",\"\",IFERROR(INDEX(Ingredients_DB!$T$2:$T$501, MATCH($B38, Ingredients_DB!$B$2:$B$501,0)),0))","v":""},{"$f":"IF($B38=\"\",\"\",IFERROR(INDEX(Ingredients_DB!$U$2:$U$501, MATCH($B38, Ingredients_DB!$B$2:$B$501,0)),0))","v":""},{"$f":"IF($B38=\"\",\"\",IFERROR(INDEX(Ingredients_DB!$V$2:$V$501, MATCH($B38, Ingredients_DB!$B$2:$B$501,0)),0))","v":""},{"$f":"IF($B38=\"\",\"\",IFERROR(INDEX(Ingredients_DB!$W$2:$W$501, MATCH($B38, Ingredients_DB!$B$2:$B$501,0)),0))","v":""},{"$f":"IF($B38=\"\",\"\",IFERROR(INDEX(Ingredients_DB!$X$2:$X$501, MATCH($B38, Ingredients_DB!$B$2:$B$501,0)),0))","v":""},{"$f":"IF($B38=\"\",\"\",IFERROR(INDEX(Ingredients_DB!$Y$2:$Y$501, MATCH($B38, Ingredients_DB!$B$2:$B$501,0)),0))","v":""},{"$f":"IF($B38=\"\",\"\",IFERROR(INDEX(Ingredients_DB!$Z$2:$Z$501, MATCH($B38, Ingredients_DB!$B$2:$B$501,0)),0))","v":""}]
[19,null,{"v":0,"d":"0.00"},"g",null,"",{"$f":"IF($B39=\"\",\"\",IFERROR(INDEX(Ingredients_DB!$K$2:$K$501, MATCH($B39, Ingredients_DB!$B$2:$B$501,0)),0))","v":""},"",{"$nulls":6},{"$f":"IF($B39=\"\",\"\",IFERROR(INDEX(Ingredients_DB!$H$2:$H$501, MATCH($B39, Ingredients_DB!$B$2:$B$501,0)),\"\"))","v":""},{"$f":"IF($B39=\"\",\"\",IFERROR(INDEX(Ingredients_DB!$I$2:$I$501, MATCH($B39, Ingredients_DB!$B$2:$B$501,0)),\"\"))","v":""},{"$f":"IF($B39=\"\",\"\",IFERROR(VLOOKUP($O39&\"|\"&$D39,UOM_Conversions!$A$2:$E$50,4,FALSE),\"CHECK UNIT\"))","v":""},{"$f":"IF($B39=\"\",\"\",IFERROR(INDEX(Ingredients_DB!$M$2:$M$501, MATCH($B39, Ingredients_DB!$B$2:$B$501,0)),0))","v":""},{"$f":"IF($B39=\"\",\"\",IFERROR(INDEX(Ingredients_DB!$N$2:$N$501, MATCH($B39, Ingredients_DB!$B$2:$B$501,0)),0))","v":""},{"$f":"IF($B39=\"\",\"\",IFERROR(INDEX(Ingredients_DB!$O$2:$O$501, MATCH($B39, Ingredients_DB!$B$2:$B$501,0)),0))","v":""},{"$f":"IF($B39=\"\",\"\",IFERROR(INDEX(Ingredients_DB!$P$2:$P$501, MATCH($B39, Ingredients_DB!$B$2:$B$501,0)),0))","v":""},{"$f":"IF($B39=\"\",\"\",IFERROR(INDEX(Ingredients_DB!$Q$2:$Q$501, MATCH($B39, Ingredients_DB!$B$2:$B$501,0)),0))","v":""},{"$f":"IF($B39=\"\",\"\",IFERROR(INDEX(Ingredients_DB!$R$2:$R$501, MATCH($B39, Ingredients_DB!$B$2:$B$501,0)),0))","v":""},{"$f":"IF($B39=\"\",\"\",IFERROR(INDEX(Ingredients_DB!$S$2:$S$501, MATCH($B39, Ingredients_DB!$B$2:$B$501,0)),0))","v":""},{"$f":"IF($B39=\"\",\"\",IFERROR(INDEX(Ingredients_DB!$T$2:$T$501, MATCH($B39, Ingredients_DB!$B$2:$B$501,0)),0))","v":""},{"$f":"IF($B39=\"\",\"\",IFERROR(INDEX(Ingredients_DB!$U$2:$U$501, MATCH($B39, Ingredients_DB!$B$2:$B$501,0)),0))","v":""},{"$f":"IF($B39=\"\",\"\",IFERROR(INDEX(Ingredients_DB!$V$2:$V$501, MATCH($B39, Ingredients_DB!$B$2:$B$501,0)),0))","v":""},{"$f":"IF($B39=\"\",\"\",IFERROR(INDEX(Ingredients_DB!$W$2:$W$501, MATCH($B39, Ingredients_DB!$B$2:$B$501,0)),0))","v":""},{"$f":"IF($B39=\"\",\"\",IFERROR(INDEX(Ingredients_DB!$X$2:$X$501, MATCH($B39, Ingredients_DB!$B$2:$B$501,0)),0))","v":""},{"$f":"IF($B39=\"\",\"\",IFERROR(INDEX(Ingredients_DB!$Y$2:$Y$501, MATCH($B39, Ingredients_DB!$B$2:$B$501,0)),0))","v":""},{"$f":"IF($B39=\"\",\"\",IFERROR(INDEX(Ingredients_DB!$Z$2:$Z$501, MATCH($B39, Ingredients_DB!$B$2:$B$501,0)),0))","v":""}]
[20,null,{"v":0,"d":"0.00"},"g",null,"",{"$f":"IF($B40=\"\",\"\",IFERROR(INDEX(Ingredients_DB!$K$2:$K$501, MATCH($B40, Ingredients_DB!$B$2:$B$501,0)),0))","v":""},"",{"$nulls":6},{"$f":"IF($B40=\"\",\"\",IFERROR(INDEX(Ingredients_DB!$H$2:$H$501, MATCH($B40, Ingredients_DB!$B$2:$B$501,0)),\"\"))","v":""},{"$f":"IF($B40=\"\",\"\",IFERROR(INDEX(Ingredients_DB!$I$2:$I$501, MATCH($B40, Ingredients_DB!$B$2:$B$501,0)),\"\"))","v":""},{"$f":"IF($B40=\"\",\"\",IFERROR(VLOOKUP($O40&\"|\"&$D40,UOM_Conversions!$A$2:$E$50,4,FALSE),\"CHECK UNIT\"))","v":""},{"$f":"IF($B40=\"\",\"\",IFERROR(INDEX(Ingredients_DB!$M$2:$M$501, MATCH($B40, Ingredients_DB!$B$2:$B$501,0)),0))","v":""},{"$f":"IF($B40=\"\",\"\",IFERROR(INDEX(Ingredients_DB!$N$2:$N$501, MATCH($B40, Ingredients_DB!$B$2:$B$501,0)),0))","v":""},{"$f":"IF($B40=\"\",\"\",IFERROR(INDEX(Ingredients_DB!$O$2:$O$501, MATCH($B40, Ingredients_DB!$B$2:$B$501,0)),0))","v":""},{"$f":"IF($B40=\"\",\"\",IFERROR(INDEX(Ingredients_DB!$P$2:$P$501, MATCH($B40, Ingredients_DB!$B$2:$B$501,0)),0))","v":""},{"$f":"IF($B40=\"\",\"\",IFERROR(INDEX(Ingredients_DB!$Q$2:$Q$501, MATCH($B40, Ingredients_DB!$B$2:$B$501,0)),0))","v":""},{"$f":"IF($B40=\"\",\"\",IFERROR(INDEX(Ingredients_DB!$R$2:$R$501, MATCH($B40, Ingredients_DB!$B$2:$B$501,0)),0))","v":""},{"$f":"IF($B40=\"\",\"\",IFERROR(INDEX(Ingredients_DB!$S$2:$S$501, MATCH($B40, Ingredients_DB!$B$2:$B$501,0)),0))","v":""},{"$f":"IF($B40=\"\",\"\",IFERROR(INDEX(Ingredients_DB!$T$2:$T$501, MATCH($B40, Ingredients_DB!$B$2:$B$501,0)),0))","v":""},{"$f":"IF($B40=\"\",\"\",IFERROR(INDEX(Ingredients_DB!$U$2:$U$501, MATCH($B40, Ingredients_DB!$B$2:$B$501,0)),0))","v":""},{"$f":"IF($B40=\"\",\"\",IFERROR(INDEX(Ingredients_DB!$V$2:$V$501, MATCH($B40, Ingredients_DB!$B$2:$B$501,0)),0))","v":""},{"$f":"IF($B40=\"\",\"\",IFERROR(INDEX(Ingredients_DB!$W$2:$W$501, MATCH($B40, Ingredients_DB!$B$2:$B$501,0)),0))","v":""},{"$f":"IF($B40=\"\",\"\",IFERROR(INDEX(Ingredients_DB!$X$2:$X$501, MATCH($B40, Ingredients_DB!$B$2:$B$501,0)),0))","v":""},{"$f":"IF($B40=\"\",\"\",IFERROR(INDEX(Ingredients_DB!$Y$2:$Y$501, MATCH($B40, Ingredients_DB!$B$2:$B$501,0)),0))","v":""},{"$f":"IF($B40=\"\",\"\",IFERROR(INDEX(Ingredients_DB!$Z$2:$Z$501, MATCH($B40, Ingredients_DB!$B$2:$B$501,0)),0))","v":""}]
[21,null,{"v":0,"d":"0.00"},"g",null,"",{"$f":"IF($B41=\"\",\"\",IFERROR(INDEX(Ingredients_DB!$K$2:$K$501, MATCH($B41, Ingredients_DB!$B$2:$B$501,0)),0))","v":""},"",{"$nulls":6},{"$f":"IF($B41=\"\",\"\",IFERROR(INDEX(Ingredients_DB!$H$2:$H$501, MATCH($B41, Ingredients_DB!$B$2:$B$501,0)),\"\"))","v":""},{"$f":"IF($B41=\"\",\"\",IFERROR(INDEX(Ingredients_DB!$I$2:$I$501, MATCH($B41, Ingredients_DB!$B$2:$B$501,0)),\"\"))","v":""},{"$f":"IF($B41=\"\",\"\",IFERROR(VLOOKUP($O41&\"|\"&$D41,UOM_Conversions!$A$2:$E$50,4,FALSE),\"CHECK UNIT\"))","v":""},{"$f":"IF($B41=\"\",\"\",IFERROR(INDEX(Ingredients_DB!$M$2:$M$501, MATCH($B41, Ingredients_DB!$B$2:$B$501,0)),0))","v":""},{"$f":"IF($B41=\"\",\"\",IFERROR(INDEX(Ingredients_DB!$N$2:$N$501, MATCH($B41, Ingredients_DB!$B$2:$B$501,0)),0))","v":""},{"$f":"IF($B41=\"\",\"\",IFERROR(INDEX(Ingredients_DB!$O$2:$O$501, MATCH($B41, Ingredients_DB!$B$2:$B$501,0)),0))","v":""},{"$f":"IF($B41=\"\",\"\",IFERROR(INDEX(Ingredients_DB!$P$2:$P$501, MATCH($B41, Ingredients_DB!$B$2:$B$501,0)),0))","v":""},{"$f":"IF($B41=\"\",\"\",IFERROR(INDEX(Ingredients_DB!$Q$2:$Q$501, MATCH($B41, Ingredients_DB!$B$2:$B$501,0)),0))","v":""},{"$f":"IF($B41=\"\",\"\",IFERROR(INDEX(Ingredients_DB!$R$2:$R$501, MATCH($B41, Ingredients_DB!$B$2:$B$501,0)),0))","v":""},{"$f":"IF($B41=\"\",\"\",IFERROR(INDEX(Ingredients_DB!$S$2:$S$501, MATCH($B41, Ingredients_DB!$B$2:$B$501,0)),0))","v":""},{"$f":"IF($B41=\"\",\"\",IFERROR(INDEX(Ingredients_DB!$T$2:$T$501, MATCH($B41, Ingredients_DB!$B$2:$B$501,0)),0))","v":""},{"$f":"IF($B41=\"\",\"\",IFERROR(INDEX(Ingredients_DB!$U$2:$U$501, MATCH($B41, Ingredients_DB!$B$2:$B$501,0)),0))","v":""},{"$f":"IF($B41=\"\",\"\",IFERROR(INDEX(Ingredients_DB!$V$2:$V$501, MATCH($B41, Ingredients_DB!$B$2:$B$501,0)),0))","v":""},{"$f":"IF($B41=\"\",\"\",IFERROR(INDEX(Ingredients_DB!$W$2:$W$501, MATCH($B41, Ingredients_DB!$B$2:$B$501,0)),0))","v":""},{"$f":"IF($B41=\"\",\"\",IFERROR(INDEX(Ingredients_DB!$X$2:$X$501, MATCH($B41, Ingredients_DB!$B$2:$B$501,0)),0))","v":""},{"$f":"IF($B41=\"\",\"\",IFERROR(INDEX(Ingredients_DB!$Y$2:$Y$501, MATCH($B41, Ingredients_DB!$B$2:$B$501,0)),0))","v":""},{"$f":"IF($B41=\"\",\"\",IFERROR(INDEX(Ingredients_DB!$Z$2:$Z$501, MATCH($B41, Ingredients_DB!$B$2:$B$501,0)),0))","v":""}]
[22,null,{"v":0,"d":"0.00"},"g",null,"",{"$f":"IF($B42=\"\",\"\",IFERROR(INDEX(Ingredients_DB!$K$2:$K$501, MATCH($B42, Ingredients_DB!$B$2:$B$501,0)),0))","v":""},"",{"$nulls":6},{"$f":"IF($B42=\"\",\"\",IFERROR(INDEX(Ingredients_DB!$H$2:$H$501, MATCH($B42, Ingredients_DB!$B$2:$B$501,0)),\"\"))","v":""},{"$f":"IF($B42=\"\",\"\",IFERROR(INDEX(Ingredients_DB!$I$2:$I$501, MATCH($B42, Ingredients_DB!$B$2:$B$501,0)),\"\"))","v":""},{"$f":"IF($B42=\"\",\"\",IFERROR(VLOOKUP($O42&\"|\"&$D42,UOM_Conversions!$A$2:$E$50,4,FALSE),\"CHECK UNIT\"))","v":""},{"$f":"IF($B42=\"\",\"\",IFERROR(INDEX(Ingredients_DB!$M$2:$M$501, MATCH($B42, Ingredients_DB!$B$2:$B$501,0)),0))","v":""},{"$f":"IF($B42=\"\",\"\",IFERROR(INDEX(Ingredients_DB!$N$2:$N$501, MATCH($B42, Ingredients_DB!$B$2:$B$501,0)),0))","v":""},{"$f":"IF($B42=\"\",\"\",IFERROR(INDEX(Ingredients_DB!$O$2:$O$501, MATCH($B42, Ingredients_DB!$B$2:$B$501,0)),0))","v":""},{"$f":"IF($B42=\"\",\"\",IFERROR(INDEX(Ingredients_DB!$P$2:$P$501, MATCH($B42, Ingredients_DB!$B$2:$B$501,0)),0))","v":""},{"$f":"IF($B42=\"\",\"\",IFERROR(INDEX(Ingredients_DB!$Q$2:$Q$501, MATCH($B42, Ingredients_DB!$B$2:$B$501,0)),0))","v":""},{"$f":"IF($B42=\"\",\"\",IFERROR(INDEX(Ingredients_DB!$R$2:$R$501, MATCH($B42, Ingredients_DB!$B$2:$B$501,0)),0))","v":""},{"$f":"IF($B42=\"\",\"\",IFERROR(INDEX(Ingredients_DB!$S$2:$S$501, MATCH($B42, Ingredients_DB!$B$2:$B$501,0)),0))","v":""},{"$f":"IF($B42=\"\",\"\",IFERROR(INDEX(Ingredients_DB!$T$2:$T$501, MATCH($B42, Ingredients_DB!$B$2:$B$501,0)),0))","v":""},{"$f":"IF($B42=\"\",\"\",IFERROR(INDEX(Ingredients_DB!$U$2:$U$501, MATCH($B42, Ingredients_DB!$B$2:$B$501,0)),0))","v":""},{"$f":"IF($B42=\"\",\"\",IFERROR(INDEX(Ingredients_DB!$V$2:$V$501, MATCH($B42, Ingredients_DB!$B$2:$B$501,0)),0))","v":""},{"$f":"IF($B42=\"\",\"\",IFERROR(INDEX(Ingredients_DB!$W$2:$W$501, MATCH($B42, Ingredients_DB!$B$2:$B$501,0)),0))","v":""},{"$f":"IF($B42=\"\",\"\",IFERROR(INDEX(Ingredients_DB!$X$2:$X$501, MATCH($B42, Ingredients_DB!$B$2:$B$501,0)),0))","v":""},{"$f":"IF($B42=\"\",\"\",IFERROR(INDEX(Ingredients_DB!$Y$2:$Y$501, MATCH($B42, Ingredients_DB!$B$2:$B$501,0)),0))","v":""},{"$f":"IF($B42=\"\",\"\",IFERROR(INDEX(Ingredients_DB!$Z$2:$Z$501, MATCH($B42, Ingredients_DB!$B$2:$B$501,0)),0))","v":""}]
[23,null,{"v":0,"d":"0.00"},"g",null,"",{"$f":"IF($B43=\"\",\"\",IFERROR(INDEX(Ingredients_DB!$K$2:$K$501, MATCH($B43, Ingredients_DB!$B$2:$B$501,0)),0))","v":""},"",{"$nulls":6},{"$f":"IF($B43=\"\",\"\",IFERROR(INDEX(Ingredients_DB!$H$2:$H$501, MATCH($B43, Ingredients_DB!$B$2:$B$501,0)),\"\"))","v":""},{"$f":"IF($B43=\"\",\"\",IFERROR(INDEX(Ingredients_DB!$I$2:$I$501, MATCH($B43, Ingredients_DB!$B$2:$B$501,0)),\"\"))","v":""},{"$f":"IF($B43=\"\",\"\",IFERROR(VLOOKUP($O43&\"|\"&$D43,UOM_Conversions!$A$2:$E$50,4,FALSE),\"CHECK UNIT\"))","v":""},{"$f":"IF($B43=\"\",\"\",IFERROR(INDEX(Ingredients_DB!$M$2:$M$501, MATCH($B43, Ingredients_DB!$B$2:$B$501,0)),0))","v":""},{"$f":"IF($B43=\"\",\"\",IFERROR(INDEX(Ingredients_DB!$N$2:$N$501, MATCH($B43, Ingredients_DB!$B$2:$B$501,0)),0))","v":""},{"$f":"IF($B43=\"\",\"\",IFERROR(INDEX(Ingredients_DB!$O$2:$O$501, MATCH($B43, Ingredients_DB!$B$2:$B$501,0)),0))","v":""},{"$f":"IF($B43=\"\",\"\",IFERROR(INDEX(Ingredients_DB!$P$2:$P$501, MATCH($B43, Ingredients_DB!$B$2:$B$501,0)),0))","v":""},{"$f":"IF($B43=\"\",\"\",IFERROR(INDEX(Ingredients_DB!$Q$2:$Q$501, MATCH($B43, Ingredients_DB!$B$2:$B$501,0)),0))","v":""},{"$f":"IF($B43=\"\",\"\",IFERROR(INDEX(Ingredients_DB!$R$2:$R$501, MATCH($B43, Ingredients_DB!$B$2:$B$501,0)),0))","v":""},{"$f":"IF($B43=\"\",\"\",IFERROR(INDEX(Ingredients_DB!$S$2:$S$501, MATCH($B43, Ingredients_DB!$B$2:$B$501,0)),0))","v":""},{"$f":"IF($B43=\"\",\"\",IFERROR(INDEX(Ingredients_DB!$T$2:$T$501, MATCH($B43, Ingredients_DB!$B$2:$B$501,0)),0))","v":""},{"$f":"IF($B43=\"\",\"\",IFERROR(INDEX(Ingredients_DB!$U$2:$U$501, MATCH($B43, Ingredients_DB!$B$2:$B$501,0)),0))","v":""},{"$f":"IF($B43=\"\",\"\",IFERROR(INDEX(Ingredients_DB!$V$2:$V$501, MATCH($B43, Ingredients_DB!$B$2:$B$501,0)),0))","v":""},{"$f":"IF($B43=\"\",\"\",IFERROR(INDEX(Ingredients_DB!$W$2:$W$501, MATCH($B43, Ingredients_DB!$B$2:$B$501,0)),0))","v":""},{"$f":"IF($B43=\"\",\"\",IFERROR(INDEX(Ingredients_DB!$X$2:$X$501, MATCH($B43, Ingredients_DB!$B$2:$B$501,0)),0))","v":""},{"$f":"IF($B43=\"\",\"\",IFERROR(INDEX(Ingredients_DB!$Y$2:$Y$501, MATCH($B43, Ingredients_DB!$B$2:$B$501,0)),0))","v":""},{"$f":"IF($B43=\"\",\"\",IFERROR(INDEX(Ingredients_DB!$Z$2:$Z$501, MATCH($B43, Ingredients_DB!$B$2:$B$501,0)),0))","v":""}]
[24,null,{"v":0,"d":"0.00"},"g",null,"",{"$f":"IF($B44=\"\",\"\",IFERROR(INDEX(Ingredients_DB!$K$2:$K$501, MATCH($B44, Ingredients_DB!$B$2:$B$501,0)),0))","v":""},"",{"$nulls":6},{"$f":"IF($B44=\"\",\"\",IFERROR(INDEX(Ingredients_DB!$H$2:$H$501, MATCH($B44, Ingredients_DB!$B$2:$B$501,0)),\"\"))","v":""},{"$f":"IF($B44=\"\",\"\",IFERROR(INDEX(Ingredients_DB!$I$2:$I$501, MATCH($B44, Ingredients_DB!$B$2:$B$501,0)),\"\"))","v":""},{"$f":"IF($B44=\"\",\"\",IFERROR(VLOOKUP($O44&\"|\"&$D44,UOM_Conversions!$A$2:$E$50,4,FALSE),\"CHECK UNIT\"))","v":""},{"$f":"IF($B44=\"\",\"\",IFERROR(INDEX(Ingredients_DB!$M$2:$M$501, MATCH($B44, Ingredients_DB!$B$2:$B$501,0)),0))","v":""},{"$f":"IF($B44=\"\",\"\",IFERROR(INDEX(Ingredients_DB!$N$2:$N$501, MATCH($B44, Ingredients_DB!$B$2:$B$501,0)),0))","v":""},{"$f":"IF($B44=\"\",\"\",IFERROR(INDEX(Ingredients_DB!$O$2:$O$501, MATCH($B44, Ingredients_DB!$B$2:$B$501,0)),0))","v":""},{"$f":"IF($B44=\"\",\"\",IFERROR(INDEX(Ingredients_DB!$P$2:$P$501, MATCH($B44, Ingredients_DB!$B$2:$B$501,0)),0))","v":""},{"$f":"IF($B44=\"\",\"\",IFERROR(INDEX(Ingredients_DB!$Q$2:$Q$501, MATCH($B44, Ingredients_DB!$B$2:$B$501,0)),0))","v":""},{"$f":"IF($B44=\"\",\"\",IFERROR(INDEX(Ingredients_DB!$R$2:$R$501, MATCH($B44, Ingredients_DB!$B$2:$B$501,0)),0))","v":""},{"$f":"IF($B44=\"\",\"\",IFERROR(INDEX(Ingredients_DB!$S$2:$S$501, MATCH($B44, Ingredients_DB!$B$2:$B$501,0)),0))","v":""},{"$f":"IF($B44=\"\",\"\",IFERROR(INDEX(Ingredients_DB!$T$2:$T$501, MATCH($B44, Ingredients_DB!$B$2:$B$501,0)),0))","v":""},{"$f":"IF($B44=\"\",\"\",IFERROR(INDEX(Ingredients_DB!$U$2:$U$501, MATCH($B44, Ingredients_DB!$B$2:$B$501,0)),0))","v":""},{"$f":"IF($B44=\"\",\"\",IFERROR(INDEX(Ingredients_DB!$V$2:$V$501, MATCH($B44, Ingredients_DB!$B$2:$B$501,0)),0))","v":""},{"$f":"IF($B44=\"\",\"\",IFERROR(INDEX(Ingredients_DB!$W$2:$W$501, MATCH($B44, Ingredients_DB!$B$2:$B$501,0)),0))","v":""},{"$f":"IF($B44=\"\",\"\",IFERROR(INDEX(Ingredients_DB!$X$2:$X$501, MATCH($B44, Ingredients_DB!$B$2:$B$501,0)),0))","v":""},{"$f":"IF($B44=\"\",\"\",IFERROR(INDEX(Ingredients_DB!$Y$2:$Y$501, MATCH($B44, Ingredients_DB!$B$2:$B$501,0)),0))","v":""},{"$f":"IF($B44=\"\",\"\",IFERROR(INDEX(Ingredients_DB!$Z$2:$Z$501, MATCH($B44, Ingredients_DB!$B$2:$B$501,0)),0))","v":""}]
[25,null,{"v":0,"d":"0.00"},"g",null,"",{"$f":"IF($B45=\"\",\"\",IFERROR(INDEX(Ingredients_DB!$K$2:$K$501, MATCH($B45, Ingredients_DB!$B$2:$B$501,0)),0))","v":""},"",{"$nulls":6},{"$f":"IF($B45=\"\",\"\",IFERROR(INDEX(Ingredients_DB!$H$2:$H$501, MATCH($B45, Ingredients_DB!$B$2:$B$501,0)),\"\"))","v":""},{"$f":"IF($B45=\"\",\"\",IFERROR(INDEX(Ingredients_DB!$I$2:$I$501, MATCH($B45, Ingredients_DB!$B$2:$B$501,0)),\"\"))","v":""},{"$f":"IF($B45=\"\",\"\",IFERROR(VLOOKUP($O45&\"|\"&$D45,UOM_Conversions!$A$2:$E$50,4,FALSE),\"CHECK UNIT\"))","v":""},{"$f":"IF($B45=\"\",\"\",IFERROR(INDEX(Ingredients_DB!$M$2:$M$501, MATCH($B45, Ingredients_DB!$B$2:$B$501,0)),0))","v":""},{"$f":"IF($B45=\"\",\"\",IFERROR(INDEX(Ingredients_DB!$N$2:$N$501, MATCH($B45, Ingredients_DB!$B$2:$B$501,0)),0))","v":""},{"$f":"IF($B45=\"\",\"\",IFERROR(INDEX(Ingredients_DB!$O$2:$O$501, MATCH($B45, Ingredients_DB!$B$2:$B$501,0)),0))","v":""},{"$f":"IF($B45=\"\",\"\",IFERROR(INDEX(Ingredients_DB!$P$2:$P$501, MATCH($B45, Ingredients_DB!$B$2:$B$501,0)),0))","v":""},{"$f":"IF($B45=\"\",\"\",IFERROR(INDEX(Ingredients_DB!$Q$2:$Q$501, MATCH($B45, Ingredients_DB!$B$2:$B$501,0)),0))","v":""},{"$f":"IF($B45=\"\",\"\",IFERROR(INDEX(Ingredients_DB!$R$2:$R$501, MATCH($B45, Ingredients_DB!$B$2:$B$501,0)),0))","v":""},{"$f":"IF($B45=\"\",\"\",IFERROR(INDEX(Ingredients_DB!$S$2:$S$501, MATCH($B45, Ingredients_DB!$B$2:$B$501,0)),0))","v":""},{"$f":"IF($B45=\"\",\"\",IFERROR(INDEX(Ingredients_DB!$T$2:$T$501, MATCH($B45, Ingredients_DB!$B$2:$B$501,0)),0))","v":""},{"$f":"IF($B45=\"\",\"\",IFERROR(INDEX(Ingredients_DB!$U$2:$U$501, MATCH($B45, Ingredients_DB!$B$2:$B$501,0)),0))","v":""},{"$f":"IF($B45=\"\",\"\",IFERROR(INDEX(Ingredients_DB!$V$2:$V$501, MATCH($B45, Ingredients_DB!$B$2:$B$501,0)),0))","v":""},{"$f":"IF($B45=\"\",\"\",IFERROR(INDEX(Ingredients_DB!$W$2:$W$501, MATCH($B45, Ingredients_DB!$B$2:$B$501,0)),0))","v":""},{"$f":"IF($B45=\"\",\"\",IFERROR(INDEX(Ingredients_DB!$X$2:$X$501, MATCH($B45, Ingredients_DB!$B$2:$B$501,0)),0))","v":""},{"$f":"IF($B45=\"\",\"\",IFERROR(INDEX(Ingredients_DB!$Y$2:$Y$501, MATCH($B45, Ingredients_DB!$B$2:$B$501,0)),0))","v":""},{"$f":"IF($B45=\"\",\"\",IFERROR(INDEX(Ingredients_DB!$Z$2:$Z$501, MATCH($B45, Ingredients_DB!$B$2:$B$501,0)),0))","v":""}]
[26,null,{"v":0,"d":"0.00"},"g",null,"",{"$f":"IF($B46=\"\",\"\",IFERROR(INDEX(Ingredients_DB!$K$2:$K$501, MATCH($B46, Ingredients_DB!$B$2:$B$501,0)),0))","v":""},"",{"$nulls":6},{"$f":"IF($B46=\"\",\"\",IFERROR(INDEX(Ingredients_DB!$H$2:$H$501, MATCH($B46, Ingredients_DB!$B$2:$B$501,0)),\"\"))","v":""},{"$f":"IF($B46=\"\",\"\",IFERROR(INDEX(Ingredients_DB!$I$2:$I$501, MATCH($B46, Ingredients_DB!$B$2:$B$501,0)),\"\"))","v":""},{"$f":"IF($B46=\"\",\"\",IFERROR(VLOOKUP($O46&\"|\"&$D46,UOM_Conversions!$A$2:$E$50,4,FALSE),\"CHECK UNIT\"))","v":""},{"$f":"IF($B46=\"\",\"\",IFERROR(INDEX(Ingredients_DB!$M$2:$M$501, MATCH($B46, Ingredients_DB!$B$2:$B$501,0)),0))","v":""},{"$f":"IF($B46=\"\",\"\",IFERROR(INDEX(Ingredients_DB!$N$2:$N$501, MATCH($B46, Ingredients_DB!$B$2:$B$501,0)),0))","v":""},{"$f":"IF($B46=\"\",\"\",IFERROR(INDEX(Ingredients_DB!$O$2:$O$501, MATCH($B46, Ingredients_DB!$B$2:$B$501,0)),0))","v":""},{"$f":"IF($B46=\"\",\"\",IFERROR(INDEX(Ingredients_DB!$P$2:$P$501, MATCH($B46, Ingredients_DB!$B$2:$B$501,0)),0))","v":""},{"$f":"IF($B46=\"\",\"\",IFERROR(INDEX(Ingredients_DB!$Q$2:$Q$501, MATCH($B46, Ingredients_DB!$B$2:$B$501,0)),0))","v":""},{"$f":"IF($B46=\"\",\"\",IFERROR(INDEX(Ingredients_DB!$R$2:$R$501, MATCH($B46, Ingredients_DB!$B$2:$B$501,0)),0))","v":""},{"$f":"IF($B46=\"\",\"\",IFERROR(INDEX(Ingredients_DB!$S$2:$S$501, MATCH($B46, Ingredients_DB!$B$2:$B$501,0)),0))","v":""},{"$f":"IF($B46=\"\",\"\",IFERROR(INDEX(Ingredients_DB!$T$2:$T$501, MATCH($B46, Ingredients_DB!$B$2:$B$501,0)),0))","v":""},{"$f":"IF($B46=\"\",\"\",IFERROR(INDEX(Ingredients_DB!$U$2:$U$501, MATCH($B46, Ingredients_DB!$B$2:$B$501,0)),0))","v":""},{"$f":"IF($B46=\"\",\"\",IFERROR(INDEX(Ingredients_DB!$V$2:$V$501, MATCH($B46, Ingredients_DB!$B$2:$B$501,0)),0))","v":""},{"$f":"IF($B46=\"\",\"\",IFERROR(INDEX(Ingredients_DB!$W$2:$W$501, MATCH($B46, Ingredients_DB!$B$2:$B$501,0)),0))","v":""},{"$f":"IF($B46=\"\",\"\",IFERROR(INDEX(Ingredients_DB!$X$2:$X$501, MATCH($B46, Ingredients_DB!$B$2:$B$501,0)),0))","v":""},{"$f":"IF($B46=\"\",\"\",IFERROR(INDEX(Ingredients_DB!$Y$2:$Y$501, MATCH($B46, Ingredients_DB!$B$2:$B$501,0)),0))","v":""},{"$f":"IF($B46=\"\",\"\",IFERROR(INDEX(Ingredients_DB!$Z$2:$Z$501, MATCH($B46, Ingredients_DB!$B$2:$B$501,0)),0))","v":""}]
[27,null,{"v":0,"d":"0.00"},"g",null,"",{"$f":"IF($B47=\"\",\"\",IFERROR(INDEX(Ingredients_DB!$K$2:$K$501, MATCH($B47, Ingredients_DB!$B$2:$B$501,0)),0))","v":""},"",{"$nulls":6},{"$f":"IF($B47=\"\",\"\",IFERROR(INDEX(Ingredients_DB!$H$2:$H$501, MATCH($B47, Ingredients_DB!$B$2:$B$501,0)),\"\"))","v":""},{"$f":"IF($B47=\"\",\"\",IFERROR(INDEX(Ingredients_DB!$I$2:$I$501, MATCH($B47, Ingredients_DB!$B$2:$B$501,0)),\"\"))","v":""},{"$f":"IF($B47=\"\",\"\",IFERROR(VLOOKUP($O47&\"|\"&$D47,UOM_Conversions!$A$2:$E$50,4,FALSE),\"CHECK UNIT\"))","v":""},{"$f":"IF($B47=\"\",\"\",IFERROR(INDEX(Ingredients_DB!$M$2:$M$501, MATCH($B47, Ingredients_DB!$B$2:$B$501,0)),0))","v":""},{"$f":"IF($B47=\"\",\"\",IFERROR(INDEX(Ingredients_DB!$N$2:$N$501, MATCH($B47, Ingredients_DB!$B$2:$B$501,0)),0))","v":""},{"$f":"IF($B47=\"\",\"\",IFERROR(INDEX(Ingredients_DB!$O$2:$O$501, MATCH($B47, Ingredients_DB!$B$2:$B$501,0)),0))","v":""},{"$f":"IF($B47=\"\",\"\",IFERROR(INDEX(Ingredients_DB!$P$2:$P$501, MATCH($B47, Ingredients_DB!$B$2:$B$501,0)),0))","v":""},{"$f":"IF($B47=\"\",\"\",IFERROR(INDEX(Ingredients_DB!$Q$2:$Q$501, MATCH($B47, Ingredients_DB!$B$2:$B$501,0)),0))","v":""},{"$f":"IF($B47=\"\",\"\",IFERROR(INDEX(Ingredients_DB!$R$2:$R$501, MATCH($B47, Ingredients_DB!$B$2:$B$501,0)),0))","v":""},{"$f":"IF($B47=\"\",\"\",IFERROR(INDEX(Ingredients_DB!$S$2:$S$501, MATCH($B47, Ingredients_DB!$B$2:$B$501,0)),0))","v":""},{"$f":"IF($B47=\"\",\"\",IFERROR(INDEX(Ingredients_DB!$T$2:$T$501, MATCH($B47, Ingredients_DB!$B$2:$B$501,0)),0))","v":""},{"$f":"IF($B47=\"\",\"\",IFERROR(INDEX(Ingredients_DB!$U$2:$U$501, MATCH($B47, Ingredients_DB!$B$2:$B$501,0)),0))","v":""},{"$f":"IF($B47=\"\",\"\",IFERROR(INDEX(Ingredients_DB!$V$2:$V$501, MATCH($B47, Ingredients_DB!$B$2:$B$501,0)),0))","v":""},{"$f":"IF($B47=\"\",\"\",IFERROR(INDEX(Ingredients_DB!$W$2:$W$501, MATCH($B47, Ingredients_DB!$B$2:$B$501,0)),0))","v":""},{"$f":"IF($B47=\"\",\"\",IFERROR(INDEX(Ingredients_DB!$X$2:$X$501, MATCH($B47, Ingredients_DB!$B$2:$B$501,0)),0))","v":""},{"$f":"IF($B47=\"\",\"\",IFERROR(INDEX(Ingredients_DB!$Y$2:$Y$501, MATCH($B47, Ingredients_DB!$B$2:$B$501,0)),0))","v":""},{"$f":"IF($B47=\"\",\"\",IFERROR(INDEX(Ingredients_DB!$Z$2:$Z$501, MATCH($B47, Ingredients_DB!$B$2:$B$501,0)),0))","v":""}]
[28,null,{"v":0,"d":"0.00"},"g",null,"",{"$f":"IF($B48=\"\",\"\",IFERROR(INDEX(Ingredients_DB!$K$2:$K$501, MATCH($B48, Ingredients_DB!$B$2:$B$501,0)),0))","v":""},"",{"$nulls":6},{"$f":"IF($B48=\"\",\"\",IFERROR(INDEX(Ingredients_DB!$H$2:$H$501, MATCH($B48, Ingredients_DB!$B$2:$B$501,0)),\"\"))","v":""},{"$f":"IF($B48=\"\",\"\",IFERROR(INDEX(Ingredients_DB!$I$2:$I$501, MATCH($B48, Ingredients_DB!$B$2:$B$501,0)),\"\"))","v":""},{"$f":"IF($B48=\"\",\"\",IFERROR(VLOOKUP($O48&\"|\"&$D48,UOM_Conversions!$A$2:$E$50,4,FALSE),\"CHECK UNIT\"))","v":""},{"$f":"IF($B48=\"\",\"\",IFERROR(INDEX(Ingredients_DB!$M$2:$M$501, MATCH($B48, Ingredients_DB!$B$2:$B$501,0)),0))","v":""},{"$f":"IF($B48=\"\",\"\",IFERROR(INDEX(Ingredients_DB!$N$2:$N$501, MATCH($B48, Ingredients_DB!$B$2:$B$501,0)),0))","v":""},{"$f":"IF($B48=\"\",\"\",IFERROR(INDEX(Ingredients_DB!$O$2:$O$501, MATCH($B48, Ingredients_DB!$B$2:$B$501,0)),0))","v":""},{"$f":"IF($B48=\"\",\"\",IFERROR(INDEX(Ingredients_DB!$P$2:$P$501, MATCH($B48, Ingredients_DB!$B$2:$B$501,0)),0))","v":""},{"$f":"IF($B48=\"\",\"\",IFERROR(INDEX(Ingredients_DB!$Q$2:$Q$501, MATCH($B48, Ingredients_DB!$B$2:$B$501,0)),0))","v":""},{"$f":"IF($B48=\"\",\"\",IFERROR(INDEX(Ingredients_DB!$R$2:$R$501, MATCH($B48, Ingredients_DB!$B$2:$B$501,0)),0))","v":""},{"$f":"IF($B48=\"\",\"\",IFERROR(INDEX(Ingredients_DB!$S$2:$S$501, MATCH($B48, Ingredients_DB!$B$2:$B$501,0)),0))","v":""},{"$f":"IF($B48=\"\",\"\",IFERROR(INDEX(Ingredients_DB!$T$2:$T$501, MATCH($B48, Ingredients_DB!$B$2:$B$501,0)),0))","v":""},{"$f":"IF($B48=\"\",\"\",IFERROR(INDEX(Ingredients_DB!$U$2:$U$501, MATCH($B48, Ingredients_DB!$B$2:$B$501,0)),0))","v":""},{"$f":"IF($B48=\"\",\"\",IFERROR(INDEX(Ingredients_DB!$V$2:$V$501, MATCH($B48, Ingredients_DB!$B$2:$B$501,0)),0))","v":""},{"$f":"IF($B48=\"\",\"\",IFERROR(INDEX(Ingredients_DB!$W$2:$W$501, MATCH($B48, Ingredients_DB!$B$2:$B$501,0)),0))","v":""},{"$f":"IF($B48=\"\",\"\",IFERROR(INDEX(Ingredients_DB!$X$2:$X$501, MATCH($B48, Ingredients_DB!$B$2:$B$501,0)),0))","v":""},{"$f":"IF($B48=\"\",\"\",IFERROR(INDEX(Ingredients_DB!$Y$2:$Y$501, MATCH($B48, Ingredients_DB!$B$2:$B$501,0)),0))","v":""},{"$f":"IF($B48=\"\",\"\",IFERROR(INDEX(Ingredients_DB!$Z$2:$Z$501, MATCH($B48, Ingredients_DB!$B$2:$B$501,0)),0))","v":""}]
[29,null,{"v":0,"d":"0.00"},"g",null,"",{"$f":"IF($B49=\"\",\"\",IFERROR(INDEX(Ingredients_DB!$K$2:$K$501, MATCH($B49, Ingredients_DB!$B$2:$B$501,0)),0))","v":""},"",{"$nulls":6},{"$f":"IF($B49=\"\",\"\",IFERROR(INDEX(Ingredients_DB!$H$2:$H$501, MATCH($B49, Ingredients_DB!$B$2:$B$501,0)),\"\"))","v":""},{"$f":"IF($B49=\"\",\"\",IFERROR(INDEX(Ingredients_DB!$I$2:$I$501, MATCH($B49, Ingredients_DB!$B$2:$B$501,0)),\"\"))","v":""},{"$f":"IF($B49=\"\",\"\",IFERROR(VLOOKUP($O49&\"|\"&$D49,UOM_Conversions!$A$2:$E$50,4,FALSE),\"CHECK UNIT\"))","v":""},{"$f":"IF($B49=\"\",\"\",IFERROR(INDEX(Ingredients_DB!$M$2:$M$501, MATCH($B49, Ingredients_DB!$B$2:$B$501,0)),0))","v":""},{"$f":"IF($B49=\"\",\"\",IFERROR(INDEX(Ingredients_DB!$N$2:$N$501, MATCH($B49, Ingredients_DB!$B$2:$B$501,0)),0))","v":""},{"$f":"IF($B49=\"\",\"\",IFERROR(INDEX(Ingredients_DB!$O$2:$O$501, MATCH($B49, Ingredients_DB!$B$2:$B$501,0)),0))","v":""},{"$f":"IF($B49=\"\",\"\",IFERROR(INDEX(Ingredients_DB!$P$2:$P$501, MATCH($B49, Ingredients_DB!$B$2:$B$501,0)),0))","v":""},{"$f":"IF($B49=\"\",\"\",IFERROR(INDEX(Ingredients_DB!$Q$2:$Q$501, MATCH($B49, Ingredients_DB!$B$2:$B$501,0)),0))","v":""},{"$f":"IF($B49=\"\",\"\",IFERROR(INDEX(Ingredients_DB!$R$2:$R$501, MATCH($B49, Ingredients_DB!$B$2:$B$501,0)),0))","v":""},{"$f":"IF($B49=\"\",\"\",IFERROR(INDEX(Ingredients_DB!$S$2:$S$501, MATCH($B49, Ingredients_DB!$B$2:$B$501,0)),0))","v":""},{"$f":"IF($B49=\"\",\"\",IFERROR(INDEX(Ingredients_DB!$T$2:$T$501, MATCH($B49, Ingredients_DB!$B$2:$B$501,0)),0))","v":""},{"$f":"IF($B49=\"\",\"\",IFERROR(INDEX(Ingredients_DB!$U$2:$U$501, MATCH($B49, Ingredients_DB!$B$2:$B$501,0)),0))","v":""},{"$f":"IF($B49=\"\",\"\",IFERROR(INDEX(Ingredients_DB!$V$2:$V$501, MATCH($B49, Ingredients_DB!$B$2:$B$501,0)),0))","v":""},{"$f":"IF($B49=\"\",\"\",IFERROR(INDEX(Ingredients_DB!$W$2:$W$501, MATCH($B49, Ingredients_DB!$B$2:$B$501,0)),0))","v":""},{"$f":"IF($B49=\"\",\"\",IFERROR(INDEX(Ingredients_DB!$X$2:$X$501, MATCH($B49, Ingredients_DB!$B$2:$B$501,0)),0))","v":""},{"$f":"IF($B49=\"\",\"\",IFERROR(INDEX(Ingredients_DB!$Y$2:$Y$501, MATCH($B49, Ingredients_DB!$B$2:$B$501,0)),0))","v":""},{"$f":"IF($B49=\"\",\"\",IFERROR(INDEX(Ingredients_DB!$Z$2:$Z$501, MATCH($B49, Ingredients_DB!$B$2:$B$501,0)),0))","v":""}]
[30,null,{"v":0,"d":"0.00"},"g",null,"",{"$f":"IF($B50=\"\",\"\",IFERROR(INDEX(Ingredients_DB!$K$2:$K$501, MATCH($B50, Ingredients_DB!$B$2:$B$501,0)),0))","v":""},"",{"$nulls":6},{"$f":"IF($B50=\"\",\"\",IFERROR(INDEX(Ingredients_DB!$H$2:$H$501, MATCH($B50, Ingredients_DB!$B$2:$B$501,0)),\"\"))","v":""},{"$f":"IF($B50=\"\",\"\",IFERROR(INDEX(Ingredients_DB!$I$2:$I$501, MATCH($B50, Ingredients_DB!$B$2:$B$501,0)),\"\"))","v":""},{"$f":"IF($B50=\"\",\"\",IFERROR(VLOOKUP($O50&\"|\"&$D50,UOM_Conversions!$A$2:$E$50,4,FALSE),\"CHECK UNIT\"))","v":""},{"$f":"IF($B50=\"\",\"\",IFERROR(INDEX(Ingredients_DB!$M$2:$M$501, MATCH($B50, Ingredients_DB!$B$2:$B$501,0)),0))","v":""},{"$f":"IF($B50=\"\",\"\",IFERROR(INDEX(Ingredients_DB!$N$2:$N$501, MATCH($B50, Ingredients_DB!$B$2:$B$501,0)),0))","v":""},{"$f":"IF($B50=\"\",\"\",IFERROR(INDEX(Ingredients_DB!$O$2:$O$501, MATCH($B50, Ingredients_DB!$B$2:$B$501,0)),0))","v":""},{"$f":"IF($B50=\"\",\"\",IFERROR(INDEX(Ingredients_DB!$P$2:$P$501, MATCH($B50, Ingredients_DB!$B$2:$B$501,0)),0))","v":""},{"$f":"IF($B50=\"\",\"\",IFERROR(INDEX(Ingredients_DB!$Q$2:$Q$501, MATCH($B50, Ingredients_DB!$B$2:$B$501,0)),0))","v":""},{"$f":"IF($B50=\"\",\"\",IFERROR(INDEX(Ingredients_DB!$R$2:$R$501, MATCH($B50, Ingredients_DB!$B$2:$B$501,0)),0))","v":""},{"$f":"IF($B50=\"\",\"\",IFERROR(INDEX(Ingredients_DB!$S$2:$S$501, MATCH($B50, Ingredients_DB!$B$2:$B$501,0)),0))","v":""},{"$f":"IF($B50=\"\",\"\",IFERROR(INDEX(Ingredients_DB!$T$2:$T$501, MATCH($B50, Ingredients_DB!$B$2:$B$501,0)),0))","v":""},{"$f":"IF($B50=\"\",\"\",IFERROR(INDEX(Ingredients_DB!$U$2:$U$501, MATCH($B50, Ingredients_DB!$B$2:$B$501,0)),0))","v":""},{"$f":"IF($B50=\"\",\"\",IFERROR(INDEX(Ingredients_DB!$V$2:$V$501, MATCH($B50, Ingredients_DB!$B$2:$B$501,0)),0))","v":""},{"$f":"IF($B50=\"\",\"\",IFERROR(INDEX(Ingredients_DB!$W$2:$W$501, MATCH($B50, Ingredients_DB!$B$2:$B$501,0)),0))","v":""},{"$f":"IF($B50=\"\",\"\",IFERROR(INDEX(Ingredients_DB!$X$2:$X$501, MATCH($B50, Ingredients_DB!$B$2:$B$501,0)),0))","v":""},{"$f":"IF($B50=\"\",\"\",IFERROR(INDEX(Ingredients_DB!$Y$2:$Y$501, MATCH($B50, Ingredients_DB!$B$2:$B$501,0)),0))","v":""},{"$f":"IF($B50=\"\",\"\",IFERROR(INDEX(Ingredients_DB!$Z$2:$Z$501, MATCH($B50, Ingredients_DB!$B$2:$B$501,0)),0))","v":""}]

{"sheet":"Example 3","index":7,"n_rows":50,"n_cols":31,"rows_kept":50,"merged":[[1,12,14,12],[19,10,49,12]]}
["RECIPE COST CARD",{"$nulls":9},"ALLERGEN SUMMARY (from ingredient flags)",{"$nulls":3},"For calculation (do not delete)"]
["Restaurant / Concept",null,"Demo Restaurant",null,"Last Updated","2026-02-06",{"$nulls":4},"Milk",{"$f":"IF(MAX(R21:R50)>0,\"YES\",\"\")","v":"YES"},"(e.g., gluten-free option? vegan? substitution guidance, allergen handling, etc.)"]
["Menu Item Name",null,"Example 3",{"$nulls":3},"Currency 1","Currency 2","Notes",null,"Egg",{"$f":"IF(MAX(S21:S50)>0,\"YES\",\"\")","v":"YES"}]
["Category",null,"Starter",null,"Total Batch Food Cost",null,{"$f":"IFERROR(SUM(H21:H50),0)","v":{"v":3.820921052631579,"d":"$3.82"}},null,"SUM(G21:G50)",null,"Fish",{"$f":"IF(MAX(T21:T50)>0,\"YES\",\"\")","v":""}]
["Station",null,"Grill",null,"Other Costs (packaging etc.)",{"$nulls":3},"IFERROR(SUM($G$14:$G$17),0)",null,"Shellfish",{"$f":"IF(MAX(U21:U50)>0,\"YES\",\"\")","v":""}]
["Batch Yield (portions)",null,1,null,"Total Batch Cost",null,{"$f":"G4+G5","v":{"v":3.820921052631579,"d":"$3.82"}},{"$nulls":3},"Molluscs",{"$f":"IF(MAX(V21:V50)>0,\"YES\",\"\")","v":""}]
["Portion Size",null,"1 burger + fries",null,"Cost / Portion",null,{"$f":"IFERROR(G6/$C$6,0)","v":{"v":3.820921052631579,"d":"$3.82"}},{"$nulls":3},"Peanuts",{"$f":"IF(MAX(W21:W50)>0,\"YES\",\"\")","v":""}]
["Selling Price / Portion",null,{"v":16,"d":"$16.00"},null,"Food Cost %",null,{"$f":"IFERROR(G7/$C$8,0)","v":{"v":0.23880756578947368,"d":"23.9%"}},{"$nulls":3},"Tree Nuts",{"$f":"IF(MAX(X21:X50)>0,\"YES\",\"\")","v":""}]
["Target Food Cost %",null,{"v":0.3,"d":"30.0%"},null,"Gross Profit / Portion",null,{"$f":"IFERROR($C$8-G7,0)","v":{"v":12.17907894736842,"d":"$12.18"}},{"$nulls":3},"Wheat/Gluten",{"$f":"IF(MAX(Y21:Y50)>0,\"YES\",\"\")","v":"YES"}]
["Prep Time (min)",null,10,null,"Gross Margin %",null,{"$f":"IFERROR(1-G8,0)","v":{"v":0.7611924342105263,"d":"76.1%"}},{"$nulls":3},"Soy",{"$f":"IF(MAX(Z21:Z50)>0,\"YES\",\"\")","v":"YES"}]
["Cook Time (min)",null,8,{"$nulls":7},"Sesame",{"$f":"IF(MAX(AA21:AA50)>0,\"YES\",\"\")","v":"YES"}]
["Shelf Life / Storage",null,"Hold cold 2 days; cook to order",null,"OTHER COSTS (not part of cost of sale in hotels and resorts)",{"$nulls":5},"Mustard",{"$f":"IF(MAX(AB21:AB50)>0,\"YES\",\"\")","v":""}]
[{"$nulls":4},"Description",null,"Cost",null,"Notes",null,"Celery",{"$f":"IF(MAX(AC21:AC50)>0,\"YES\",\"\")","v":""}]
[{"$nulls":4},"Packaging",null,{"v":0.25,"d":"$0.25"},{"$nulls":3},"Lupin",{"$f":"IF(MAX(AD21:AD50)>0,\"YES\",\"\")","v":""}]
[{"$nulls":4},"Napkin/condiment cup",null,{"v":0.1,"d":"$0.10"},{"$nulls":3},"Sulphites",{"$f":"IF(MAX(AE21:AE50)>0,\"YES\",\"\")","v":""}]
[{"$nulls":6},{"v":0,"d":"$0.00"}]
[{"$nulls":6},{"v":0,"d":"$0.00"}]
[]
["INGREDIENTS (enter Qty + Unit; costs auto-calc)",{"$nulls":4},"Actual Qty","Unit Cost",{"$nulls":3},"PREPARATION METHOD"]
["Line","Ingredient","Qty","Unit","Yield %","in base units","(per base)","Line Cost","Notes",null,"Step-by-step method - \n\ncritical control points - \n\nholding temps - \n\nplating - \n\ncross-contamination notes - "]
[1,"Beef mince",{"v":180,"d":"180.00"},"g",{"v":0.9,"d":"90%"},{"$f":"IF($B21=\"\",\"\",IF(ISNUMBER($Q21),$C21*$Q21/E21,\"\"))","v":{"v":200,"d":"200.00"}},{"$f":"IF($B21=\"\",\"\",IFERROR(INDEX(Ingredients_DB!$K$2:$K$501, MATCH($B21, Ingredients_DB!$B$2:$B$501,0)),0))","v":{"v":0.009,"d":"$0.01"}},{"$f":"IF($B21=\"\",\"\",IF(ISNUMBER($F21),$F21*$G21,\"\"))","v":{"v":1.7999999999999998,"d":"$1.80"}},"Patty 180g",{"$nulls":5},{"$f":"IF($B21=\"\",\"\",IFERROR(INDEX(Ingredients_DB!$H$2:$H$501, MATCH($B21, Ingredients_DB!$B$2:$B$501,0)),\"\"))","v":"Weight"},{"$f":"IF($B21=\"\",\"\",IFERROR(INDEX(Ingredients_DB!$I$2:$I$501, MATCH($B21, Ingredients_DB!$B$2:$B$501,0)),\"\"))","v":"g"},{"$f":"IF($B21=\"\",\"\",IFERROR(VLOOKUP($O21&\"|\"&$D21,UOM_Conversions!$A$2:$E$50,4,FALSE),\"CHECK UNIT\"))","v":1},{"$f":"IF($B21=\"\",\"\",IFERROR(INDEX(Ingredients_DB!$M$2:$M$501, MATCH($B21, Ingredients_DB!$B$2:$B$501,0)),0))","v":0},{"$f":"IF($B21=\"\",\"\",IFERROR(INDEX(Ingredients_DB!$N$2:$N$501, MATCH($B21, Ingredients_DB!$B$2:$B$501,0)),0))","v":0},{"$f":"IF($B21=\"\",\"\",IFERROR(INDEX(Ingredients_DB!$O$2:$O$501, MATCH($B21, Ingredients_DB!$B$2:$B$501,0)),0))","v":0},{"$f":"IF($B21=\"\",\"\",IFERROR(INDEX(Ingredients_DB!$P$2:$P$501, MATCH($B21, Ingredients_DB!$B$2:$B$501,0)),0))","v":0},{"$f":"IF($B21=\"\",\"\",IFERROR(INDEX(Ingredients_DB!$Q$2:$Q$501, MATCH($B21, Ingredients_DB!$B$2:$B$501,0)),0))","v":0},{"$f":"IF($B21=\"\",\"\",IFERROR(INDEX(Ingredients_DB!$R$2:$R$501, MATCH($B21, Ingredients_DB!$B$2:$B$501,0)),0))","v":0},{"$f":"IF($B21=\"\",\"\",IFERROR(INDEX(Ingredients_DB!$S$2:$S$501, MATCH($B21, Ingredients_DB!$B$2:$B$501,0)),0))","v":0},{"$f":"IF($B21=\"\",\"\",IFERROR(INDEX(Ingredients_DB!$T$2:$T$501, MATCH($B21, Ingredients_DB!$B$2:$B$501,0)),0))","v":0},{"$f":"IF($B21=\"\",\"\",IFERROR(INDEX(Ingredients_DB!$U$2:$U$501, MATCH($B21, Ingredients_DB!$B$2:$B$501,0)),0))","v":0},{"$f":"IF($B21=\"\",\"\",IFERROR(INDEX(Ingredients_DB!$V$2:$V$501, MATCH($B21, Ingredients_DB!$B$2:$B$501,0)),0))","v":0},{"$f":"IF($B21=\"\",\"\",IFERROR(INDEX(Ingredients_DB!$W$2:$W$501, MATCH($B21, Ingredients_DB!$B$2:$B$501,0)),0))","v":0},{"$f":"IF($B21=\"\",\"\",IFERROR(INDEX(Ingredients_DB!$X$2:$X$501, MATCH($B21, Ingredients_DB!$B$2:$B$501,0)),0))","v":0},{"$f":"IF($B21=\"\",\"\",IFERROR(INDEX(Ingredients_DB!$Y$2:$Y$501, MATCH($B21, Ingredients_DB!$B$2:$B$501,0)),0))","v":0},{"$f":"IF($B21=\"\",\"\",IFERROR(INDEX(Ingredients_DB!$Z$2:$Z$501, MATCH($B21, Ingredients_DB!$B$2:$B$501,0)),0))","v":0}]
[2,"Burger bun",{"v":1,"d":"1.00"},"each",{"v":1,"d":"100%"},{"v":1,"d":"1.00"},{"$f":"IF($B22=\"\",\"\",IFERROR(INDEX(Ingredients_DB!$K$2:$K$501, MATCH($B22, Ingredients_DB!$B$2:$B$501,0)),0))","v":{"v":0.75,"d":"$0.75"}},{"v":0.75,"d":"$0.75"},"Toasted",{"$nulls":5},{"$f":"IF($B22=\"\",\"\",IFERROR(INDEX(Ingredients_DB!$H$2:$H$501, MATCH($B22, Ingredients_DB!$B$2:$B$501,0)),\"\"))","v":"Each"},{"$f":"IF($B22=\"\",\"\",IFERROR(INDEX(Ingredients_DB!$I$2:$I$501, MATCH($B22, Ingredients_DB!$B$2:$B$501,0)),\"\"))","v":"each"},{"$f":"IF($B22=\"\",\"\",IFERROR(VLOOKUP($O22&\"|\"&$D22,UOM_Conversions!$A$2:$E$50,4,FALSE),\"CHECK UNIT\"))","v":1},{"$f":"IF($B22=\"\",\"\",IFERROR(INDEX(Ingredients_DB!$M$2:$M$501, MATCH($B22, Ingredients_DB!$B$2:$B$501,0)),0))","v":0},{"$f":"IF($B22=\"\",\"\",IFERROR(INDEX(Ingredients_DB!$N$2:$N$501, MATCH($B22, Ingredients_DB!$B$2:$B$501,0)),0))","v":0},{"$f":"IF($B22=\"\",\"\",IFERROR(INDEX(Ingredients_DB!$O$2:$O$501, MATCH($B22, Ingredients_DB!$B$2:$B$501,0)),0))","v":0},{"$f":"IF($B22=\"\",\"\",IFERROR(INDEX(Ingredients_DB!$P$2:$P$501, MATCH($B22, Ingredients_DB!$B$2:$B$501,0)),0))","v":0},{"$f":"IF($B22=\"\",\"\",IFERROR(INDEX(Ingredients_DB!$Q$2:$Q$501, MATCH($B22, Ingredients_DB!$B$2:$B$501,0)),0))","v":0},{"$f":"IF($B22=\"\",\"\",IFERROR(INDEX(Ingredients_DB!$R$2:$R$501, MATCH($B22, Ingredients_DB!$B$2:$B$501,0)),0))","v":0},{"$f":"IF($B22=\"\",\"\",IFERROR(INDEX(Ingredients_DB!$S$2:$S$501, MATCH($B22, Ingredients_DB!$B$2:$B$501,0)),0))","v":0},{"$f":"IF($B22=\"\",\"\",IFERROR(INDEX(Ingredients_DB!$T$2:$T$501, MATCH($B22, Ingredients_DB!$B$2:$B$501,0)),0))","v":1},{"$f":"IF($B22=\"\",\"\",IFERROR(INDEX(Ingredients_DB!$U$2:$U$501, MATCH($B22, Ingredients_DB!$B$2:$B$501,0)),0))","v":0},{"$f":"IF($B22=\"\",\"\",IFERROR(INDEX(Ingredients_DB!$V$2:$V$501, MATCH($B22, Ingredients_DB!$B$2:$B$501,0)),0))","v":0},{"$f":"IF($B22=\"\",\"\",IFERROR(INDEX(Ingredients_DB!$W$2:$W$501, MATCH($B22, Ingredients_DB!$B$2:$B$501,0)),0))","v":0},{"$f":"IF($B22=\"\",\"\",IFERROR(INDEX(Ingredients_DB!$X$2:$X$501, MATCH($B22, Ingredients_DB!$B$2:$B$501,0)),0))","v":0},{"$f":"IF($B22=\"\",\"\",IFERROR(INDEX(Ingredients_DB!$Y$2:$Y$501, MATCH($B22, Ingredients_DB!$B$2:$B$501,0)),0))","v":0},{"$f":"IF($B22=\"\",\"\",IFERROR(INDEX(Ingredients_DB!$Z$2:$Z$501, MATCH($B22, Ingredients_DB!$B$2:$B$501,0)),0))","v":0}]
[3,"Cheddar cheese",{"v":30,"d":"30.00"},"g",{"v":1,"d":"100%"},{"v":30,"d":"30.00"},{"$f":"IF($B23=\"\",\"\",IFERROR(INDEX(Ingredients_DB!$K$2:$K$501, MATCH($B23, Ingredients_DB!$B$2:$B$501,0)),0))","v":{"v":0.011,"d":"$0.01"}},{"v":0.32999999999999996,"d":"$0.33"},"Slice",{"$nulls":5},{"$f":"IF($B23=\"\",\"\",IFERROR(INDEX(Ingredients_DB!$H$2:$H$501, MATCH($B23, Ingredients_DB!$B$2:$B$501,0)),\"\"))","v":"Weight"},{"$f":"IF($B23=\"\",\"\",IFERROR(INDEX(Ingredients_DB!$I$2:$I$501, MATCH($B23, Ingredients_DB!$B$2:$B$501,0)),\"\"))","v":"g"},{"$f":"IF($B23=\"\",\"\",IFERROR(VLOOKUP($O23&\"|\"&$D23,UOM_Conversions!$A$2:$E$50,4,FALSE),\"CHECK UNIT\"))","v":1},{"$f":"IF($B23=\"\",\"\",IFERROR(INDEX(Ingredients_DB!$M$2:$M$501, MATCH($B23, Ingredients_DB!$B$2:$B$501,0)),0))","v":1},{"$f":"IF($B23=\"\",\"\",IFERROR(INDEX(Ingredients_DB!$N$2:$N$501, MATCH($B23, Ingredients_DB!$B$2:$B$501,0)),0))","v":0},{"$f":"IF($B23=\"\",\"\",IFERROR(INDEX(Ingredients_DB!$O$2:$O$501, MATCH($B23, Ingredients_DB!$B$2:$B$501,0)),0))","v":0},{"$f":"IF($B23=\"\",\"\",IFERROR(INDEX(Ingredients_DB!$P$2:$P$501, MATCH($B23, Ingredients_DB!$B$2:$B$501,0)),0))","v":0},{"$f":"IF($B23=\"\",\"\",IFERROR(INDEX(Ingredients_DB!$Q$2:$Q$501, MATCH($B23, Ingredients_DB!$B$2:$B$501,0)),0))","v":0},{"$f":"IF($B23=\"\",\"\",IFERROR(INDEX(Ingredients_DB!$R$2:$R$501, MATCH($B23, Ingredients_DB!$B$2:$B$501,0)),0))","v":0},{"$f":"IF($B23=\"\",\"\",IFERROR(INDEX(Ingredients_DB!$S$2:$S$501, MATCH($B23, Ingredients_DB!$B$2:$B$501,0)),0))","v":0},{"$f":"IF($B23=\"\",\"\",IFERROR(INDEX(Ingredients_DB!$T$2:$T$501, MATCH($B23, Ingredients_DB!$B$2:$B$501,0)),0))","v":0},{"$f":"IF($B23=\"\",\"\",IFERROR(INDEX(Ingredients_DB!$U$2:$U$501, MATCH($B23, Ingredients_DB!$B$2:$B$501,0)),0))","v":0},{"$f":"IF($B23=\"\",\"\",IFERROR(INDEX(Ingredients_DB!$V$2:$V$501, MATCH($B23, Ingredients_DB!$B$2:$B$501,0)),0))","v":0},{"$f":"IF($B23=\"\",\"\",IFERROR(INDEX(Ingredients_DB!$W$2:$W$501, MATCH($B23, Ingredients_DB!$B$2:$B$501,0)),0))","v":0},{"$f":"IF($B23=\"\",\"\",IFERROR(INDEX(Ingredients_DB!$X$2:$X$501, MATCH($B23, Ingredients_DB!$B$2:$B$501,0)),0))","v":0},{"$f":"IF($B23=\"\",\"\",IFERROR(INDEX(Ingredients_DB!$Y$2:$Y$501, MATCH($B23, Ingredients_DB!$B$2:$B$501,0)),0))","v":0},{"$f":"IF($B23=\"\",\"\",IFERROR(INDEX(Ingredients_DB!$Z$2:$Z$501, MATCH($B23, Ingredients_DB!$B$2:$B$501,0)),0))","v":0}]
[4,"Lettuce",{"v":20,"d":"20.00"},"g",{"v":0.95,"d":"95%"},{"v":21.05263157894737,"d":"21.05"},{"$f":"IF($B24=\"\",\"\",IFERROR(INDEX(Ingredients_DB!$K$2:$K$501, MATCH($B24, Ingredients_DB!$B$2:$B$501,0)),0))","v":{"v":0.008,"d":"$0.01"}},{"v":0.16842105263157897,"d":"$0.17"},"Shredded",{"$nulls":5},{"$f":"IF($B24=\"\",\"\",IFERROR(INDEX(Ingredients_DB!$H$2:$H$501, MATCH($B24, Ingredients_DB!$B$2:$B$501,0)),\"\"))","v":"Weight"},{"$f":"IF($B24=\"\",\"\",IFERROR(INDEX(Ingredients_DB!$I$2:$I$501, MATCH($B24, Ingredients_DB!$B$2:$B$501,0)),\"\"))","v":"g"},{"$f":"IF($B24=\"\",\"\",IFERROR(VLOOKUP($O24&\"|\"&$D24,UOM_Conversions!$A$2:$E$50,4,FALSE),\"CHECK UNIT\"))","v":1},{"$f":"IF($B24=\"\",\"\",IFERROR(INDEX(Ingredients_DB!$M$2:$M$501, MATCH($B24, Ingredients_DB!$B$2:$B$501,0)),0))","v":0},{"$f":"IF($B24=\"\",\"\",IFERROR(INDEX(Ingredients_DB!$N$2:$N$501, MATCH($B24, Ingredients_DB!$B$2:$B$501,0)),0))","v":0},{"$f":"IF($B24=\"\",\"\",IFERROR(INDEX(Ingredients_DB!$O$2:$O$501, MATCH($B24, Ingredients_DB!$B$2:$B$501,0)),0))","v":0},{"$f":"IF($B24=\"\",\"\",IFERROR(INDEX(Ingredients_DB!$P$2:$P$501, MATCH($B24, Ingredients_DB!$B$2:$B$501,0)),0))","v":0},{"$f":"IF($B24=\"\",\"\",IFERROR(INDEX(Ingredients_DB!$Q$2:$Q$501, MATCH($B24, Ingredients_DB!$B$2:$B$501,0)),0))","v":0},{"$f":"IF($B24=\"\",\"\",IFERROR(INDEX(Ingredients_DB!$R$2:$R$501, MATCH($B24, Ingredients_DB!$B$2:$B$501,0)),0))","v":0},{"$f":"IF($B24=\"\",\"\",IFERROR(INDEX(Ingredients_DB!$S$2:$S$501, MATCH($B24, Ingredients_DB!$B$2:$B$501,0)),0))","v":0},{"$f":"IF($B24=\"\",\"\",IFERROR(INDEX(Ingredients_DB!$T$2:$T$501, MATCH($B24, Ingredients_DB!$B$2:$B$501,0)),0))","v":0},{"$f":"IF($B24=\"\",\"\",IFERROR(INDEX(Ingredients_DB!$U$2:$U$501, MATCH($B24, Ingredients_DB!$B$2:$B$501,0)),0))","v":0},{"$f":"IF($B24=\"\",\"\",IFERROR(INDEX(Ingredients_DB!$V$2:$V$501, MATCH($B24, Ingredients_DB!$B$2:$B$501,0)),0))","v":0},{"$f":"IF($B24=\"\",\"\",IFERROR(INDEX(Ingredients_DB!$W$2:$W$501, MATCH($B24, Ingredients_DB!$B$2:$B$501,0)),0))","v":0},{"$f":"IF($B24=\"\",\"\",IFERROR(INDEX(Ingredients_DB!$X$2:$X$501, MATCH($B24, Ingredients_DB!$B$2:$B$501,0)),0))","v":0},{"$f":"IF($B24=\"\",\"\",IFERROR(INDEX(Ingredients_DB!$Y$2:$Y$501, MATCH($B24, Ingredients_DB!$B$2:$B$501,0)),0))","v":0},{"$f":"IF($B24=\"\",\"\",IFERROR(INDEX(Ingredients_DB!$Z$2:$Z$501, MATCH($B24, Ingredients_DB!$B$2:$B$501,0)),0))","v":0}]
[5,"Ketchup",{"v":20,"d":"20.00"},"g",{"v":1,"d":"100%"},{"v":20,"d":"20.00"},{"$f":"IF($B25=\"\",\"\",IFERROR(INDEX(Ingredients_DB!$K$2:$K$501, MATCH($B25, Ingredients_DB!$B$2:$B$501,0)),0))","v":{"v":0.004,"d":"$0.00"}},{"v":0.08,"d":"$0.08"},{"$nulls":6},{"$f":"IF($B25=\"\",\"\",IFERROR(INDEX(Ingredients_DB!$H$2:$H$501, MATCH($B25, Ingredients_DB!$B$2:$B$501,0)),\"\"))","v":"Weight"},{"$f":"IF($B25=\"\",\"\",IFERROR(INDEX(Ingredients_DB!$I$2:$I$501, MATCH($B25, Ingredients_DB!$B$2:$B$501,0)),\"\"))","v":"g"},{"$f":"IF($B25=\"\",\"\",IFERROR(VLOOKUP($O25&\"|\"&$D25,UOM_Conversions!$A$2:$E$50,4,FALSE),\"CHECK UNIT\"))","v":1},{"$f":"IF($B25=\"\",\"\",IFERROR(INDEX(Ingredients_DB!$M$2:$M$501, MATCH($B25, Ingredients_DB!$B$2:$B$501,0)),0))","v":0},{"$f":"IF($B25=\"\",\"\",IFERROR(INDEX(Ingredients_DB!$N$2:$N$501, MATCH($B25, Ingredients_DB!$B$2:$B$501,0)),0))","v":0},{"$f":"IF($B25=\"\",\"\",IFERROR(INDEX(Ingredients_DB!$O$2:$O$501, MATCH($B25, Ingredients_DB!$B$2:$B$501,0)),0))","v":0},{"$f":"IF($B25=\"\",\"\",IFERROR(INDEX(Ingredients_DB!$P$2:$P$501, MATCH($B25, Ingredients_DB!$B$2:$B$501,0)),0))","v":0},{"$f":"IF($B25=\"\",\"\",IFERROR(INDEX(Ingredients_DB!$Q$2:$Q$501, MATCH($B25, Ingredients_DB!$B$2:$B$501,0)),0))","v":0},{"$f":"IF($B25=\"\",\"\",IFERROR(INDEX(Ingredients_DB!$R$2:$R$501, MATCH($B25, Ingredients_DB!$B$2:$B$501,0)),0))","v":0},{"$f":"IF($B25=\"\",\"\",IFERROR(INDEX(Ingredients_DB!$S$2:$S$501, MATCH($B25, Ingredients_DB!$B$2:$B$501,0)),0))","v":0},{"$f":"IF($B25=\"\",\"\",IFERROR(INDEX(Ingredients_DB!$T$2:$T$501, MATCH($B25, Ingredients_DB!$B$2:$B$501,0)),0))","v":0},{"$f":"IF($B25=\"\",\"\",IFERROR(INDEX(Ingredients_DB!$U$2:$U$501, MATCH($B25, Ingredients_DB!$B$2:$B$501,0)),0))","v":0},{"$f":"IF($B25=\"\",\"\",IFERROR(INDEX(Ingredients_DB!$V$2:$V$501, MATCH($B25, Ingredients_DB!$B$2:$B$501,0)),0))","v":0},{"$f":"IF($B25=\"\",\"\",IFERROR(INDEX(Ingredients_DB!$W$2:$W$501, MATCH($B25, Ingredients_DB!$B$2:$B$501,0)),0))","v":0},{"$f":"IF($B25=\"\",\"\",IFERROR(INDEX(Ingredients_DB!$X$2:$X$501, MATCH($B25, Ingredients_DB!$B$2:$B$501,0)),0))","v":0},{"$f":"IF($B25=\"\",\"\",IFERROR(INDEX(Ingredients_DB!$Y$2:$Y$501, MATCH($B25, Ingredients_DB!$B$2:$B$501,0)),0))","v":0},{"$f":"IF($B25=\"\",\"\",IFERROR(INDEX(Ingredients_DB!$Z$2:$Z$501, MATCH($B25, Ingredients_DB!$B$2:$B$501,0)),0))","v":0}]
[6,"Mayonnaise",{"v":15,"d":"15.00"},"g",{"v":1,"d":"100%"},{"v":15,"d":"15.00"},{"$f":"IF($B26=\"\",\"\",IFERROR(INDEX(Ingredients_DB!$K$2:$K$501, MATCH($B26, Ingredients_DB!$B$2:$B$501,0)),0))","v":{"v":0.0075,"d":"$0.01"}},{"v":0.11249999999999999,"d":"$0.11"},{"$nulls":6},{"$f":"IF($B26=\"\",\"\",IFERROR(INDEX(Ingredients_DB!$H$2:$H$501, MATCH($B26, Ingredients_DB!$B$2:$B$501,0)),\"\"))","v":"Weight"},{"$f":"IF($B26=\"\",\"\",IFERROR(INDEX(Ingredients_DB!$I$2:$I$501, MATCH($B26, Ingredients_DB!$B$2:$B$501,0)),\"\"))","v":"g"},{"$f":"IF($B26=\"\",\"\",IFERROR(VLOOKUP($O26&\"|\"&$D26,UOM_Conversions!$A$2:$E$50,4,FALSE),\"CHECK UNIT\"))","v":1},{"$f":"IF($B26=\"\",\"\",IFERROR(INDEX(Ingredients_DB!$M$2:$M$501, MATCH($B26, Ingredients_DB!$B$2:$B$501,0)),0))","v":0},{"$f":"IF($B26=\"\",\"\",IFERROR(INDEX(Ingredients_DB!$N$2:$N$501, MATCH($B26, Ingredients_DB!$B$2:$B$501,0)),0))","v":1},{"$f":"IF($B26=\"\",\"\",IFERROR(INDEX(Ingredients_DB!$O$2:$O$501, MATCH($B26, Ingredients_DB!$B$2:$B$501,0)),0))","v":0},{"$f":"IF($B26=\"\",\"\",IFERROR(INDEX(Ingredients_DB!$P$2:$P$501, MATCH($B26, Ingredients_DB!$B$2:$B$501,0)),0))","v":0},{"$f":"IF($B26=\"\",\"\",IFERROR(INDEX(Ingredients_DB!$Q$2:$Q$501, MATCH($B26, Ingredients_DB!$B$2:$B$501,0)),0))","v":0},{"$f":"IF($B26=\"\",\"\",IFERROR(INDEX(Ingredients_DB!$R$2:$R$501, MATCH($B26, Ingredients_DB!$B$2:$B$501,0)),0))","v":0},{"$f":"IF($B26=\"\",\"\",IFERROR(INDEX(Ingredients_DB!$S$2:$S$501, MATCH($B26, Ingredients_DB!$B$2:$B$501,0)),0))","v":0},{"$f":"IF($B26=\"\",\"\",IFERROR(INDEX(Ingredients_DB!$T$2:$T$501, MATCH($B26, Ingredients_DB!$B$2:$B$501,0)),0))","v":0},{"$f":"IF($B26=\"\",\"\",IFERROR(INDEX(Ingredients_DB!$U$2:$U$501, MATCH($B26, Ingredients_DB!$B$2:$B$501,0)),0))","v":1},{"$f":"IF($B26=\"\",\"\",IFERROR(INDEX(Ingredients_DB!$V$2:$V$501, MATCH($B26, Ingredients_DB!$B$2:$B$501,0)),0))","v":0},{"$f":"IF($B26=\"\",\"\",IFERROR(INDEX(Ingredients_DB!$W$2:$W$501, MATCH($B26, Ingredients_DB!$B$2:$B$501,0)),0))","v":0},{"$f":"IF($B26=\"\",\"\",IFERROR(INDEX(Ingredients_DB!$X$2:$X$501, MATCH($B26, Ingredients_DB!$B$2:$B$501,0)),0))","v":0},{"$f":"IF($B26=\"\",\"\",IFERROR(INDEX(Ingredients_DB!$Y$2:$Y$501, MATCH($B26, Ingredients_DB!$B$2:$B$501,0)),0))","v":0},{"$f":"IF($B26=\"\",\"\",IFERROR(INDEX(Ingredients_DB!$Z$2:$Z$501, MATCH($B26, Ingredients_DB!$B$2:$B$501,0)),0))","v":0}]
[7,"French fries (frozen)",{"v":200,"d":"200.00"},"g",{"v":1,"d":"100%"},{"v":200,"d":"200.00"},{"$f":"IF($B27=\"\",\"\",IFERROR(INDEX(Ingredients_DB!$K$2:$K$501, MATCH($B27, Ingredients_DB!$B$2:$B$501,0)),0))","v":{"v":2.8E-3,"d":"$0.00"}},{"v":0.5599999999999999,"d":"$0.56"},"Portion",{"$nulls":5},{"$f":"IF($B27=\"\",\"\",IFERROR(INDEX(Ingredients_DB!$H$2:$H$501, MATCH($B27, Ingredients_DB!$B$2:$B$501,0)),\"\"))","v":"Weight"},{"$f":"IF($B27=\"\",\"\",IFERROR(INDEX(Ingredients_DB!$I$2:$I$501, MATCH($B27, Ingredients_DB!$B$2:$B$501,0)),\"\"))","v":"g"},{"$f":"IF($B27=\"\",\"\",IFERROR(VLOOKUP($O27&\"|\"&$D27,UOM_Conversions!$A$2:$E$50,4,FALSE),\"CHECK UNIT\"))","v":1},{"$f":"IF($B27=\"\",\"\",IFERROR(INDEX(Ingredients_DB!$M$2:$M$501, MATCH($B27, Ingredients_DB!$B$2:$B$501,0)),0))","v":0},{"$f":"IF($B27=\"\",\"\",IFERROR(INDEX(Ingredients_DB!$N$2:$N$501, MATCH($B27, Ingredients_DB!$B$2:$B$501,0)),0))","v":0},{"$f":"IF($B27=\"\",\"\",IFERROR(INDEX(Ingredients_DB!$O$2:$O$501, MATCH($B27, Ingredients_DB!$B$2:$B$501,0)),0))","v":0},{"$f":"IF($B27=\"\",\"\",IFERROR(INDEX(Ingredients_DB!$P$2:$P$501, MATCH($B27, Ingredients_DB!$B$2:$B$501,0)),0))","v":0},{"$f":"IF($B27=\"\",\"\",IFERROR(INDEX(Ingredients_DB!$Q$2:$Q$501, MATCH($B27, Ingredients_DB!$B$2:$B$501,0)),0))","v":0},{"$f":"IF($B27=\"\",\"\",IFERROR(INDEX(Ingredients_DB!$R$2:$R$501, MATCH($B27, Ingredients_DB!$B$2:$B$501,0)),0))","v":0},{"$f":"IF($B27=\"\",\"\",IFERROR(INDEX(Ingredients_DB!$S$2:$S$501, MATCH($B27, Ingredients_DB!$B$2:$B$501,0)),0))","v":0},{"$f":"IF($B27=\"\",\"\",IFERROR(INDEX(Ingredients_DB!$T$2:$T$501, MATCH($B27, Ingredients_DB!$B$2:$B$501,0)),0))","v":0},{"$f":"IF($B27=\"\",\"\",IFERROR(INDEX(Ingredients_DB!$U$2:$U$501, MATCH($B27, Ingredients_DB!$B$2:$B$501,0)),0))","v":0},{"$f":"IF($B27=\"\",\"\",IFERROR(INDEX(Ingredients_DB!$V$2:$V$501, MATCH($B27, Ingredients_DB!$B$2:$B$501,0)),0))","v":0},{"$f":"IF($B27=\"\",\"\",IFERROR(INDEX(Ingredients_DB!$W$2:$W$501, MATCH($B27, Ingredients_DB!$B$2:$B$501,0)),0))","v":0},{"$f":"IF($B27=\"\",\"\",IFERROR(INDEX(Ingredients_DB!$X$2:$X$501, MATCH($B27, Ingredients_DB!$B$2:$B$501,0)),0))","v":0},{"$f":"IF($B27=\"\",\"\",IFERROR(INDEX(Ingredients_DB!$Y$2:$Y$501, MATCH($B27, Ingredients_DB!$B$2:$B$501,0)),0))","v":0},{"$f":"IF($B27=\"\",\"\",IFERROR(INDEX(Ingredients_DB!$Z$2:$Z$501, MATCH($B27, Ingredients_DB!$B$2:$B$501,0)),0))","v":0}]
[8,"Sesame seeds",{"v":2,"d":"2.00"},"g",{"v":1,"d":"100%"},{"v":2,"d":"2.00"},{"$f":"IF($B28=\"\",\"\",IFERROR(INDEX(Ingredients_DB!$K$2:$K$501, MATCH($B28, Ingredients_DB!$B$2:$B$501,0)),0))","v":{"v":0.01,"d":"$0.01"}},{"v":0.02,"d":"$0.02"},"Bun topping (optional)",{"$nulls":5},{"$f":"IF($B28=\"\",\"\",IFERROR(INDEX(Ingredients_DB!$H$2:$H$501, MATCH($B28, Ingredients_DB!$B$2:$B$501,0)),\"\"))","v":"Weight"},{"$f":"IF($B28=\"\",\"\",IFERROR(INDEX(Ingredients_DB!$I$2:$I$501, MATCH($B28, Ingredients_DB!$B$2:$B$501,0)),\"\"))","v":"g"},{"$f":"IF($B28=\"\",\"\",IFERROR(VLOOKUP($O28&\"|\"&$D28,UOM_Conversions!$A$2:$E$50,4,FALSE),\"CHECK UNIT\"))","v":1},{"$f":"IF($B28=\"\",\"\",IFERROR(INDEX(Ingredients_DB!$M$2:$M$501, MATCH($B28, Ingredients_DB!$B$2:$B$501,0)),0))","v":0},{"$f":"IF($B28=\"\",\"\",IFERROR(INDEX(Ingredients_DB!$N$2:$N$501, MATCH($B28, Ingredients_DB!$B$2:$B$501,0)),0))","v":0},{"$f":"IF($B28=\"\",\"\",IFERROR(INDEX(Ingredients_DB!$O$2:$O$501, MATCH($B28, Ingredients_DB!$B$2:$B$501,0)),0))","v":0},{"$f":"IF($B28=\"\",\"\",IFERROR(INDEX(Ingredients_DB!$P$2:$P$501, MATCH($B28, Ingredients_DB!$B$2:$B$501,0)),0))","v":0},{"$f":"IF($B28=\"\",\"\",IFERROR(INDEX(Ingredients_DB!$Q$2:$Q$501, MATCH($B28, Ingredients_DB!$B$2:$B$501,0)),0))","v":0},{"$f":"IF($B28=\"\",\"\",IFERROR(INDEX(Ingredients_DB!$R$2:$R$501, MATCH($B28, Ingredients_DB!$B$2:$B$501,0)),0))","v":0},{"$f":"IF($B28=\"\",\"\",IFERROR(INDEX(Ingredients_DB!$S$2:$S$501, MATCH($B28, Ingredients_DB!$B$2:$B$501,0)),0))","v":0},{"$f":"IF($B28=\"\",\"\",IFERROR(INDEX(Ingredients_DB!$T$2:$T$501, MATCH($B28, Ingredients_DB!$B$2:$B$501,0)),0))","v":0},{"$f":"IF($B28=\"\",\"\",IFERROR(INDEX(Ingredients_DB!$U$2:$U$501, MATCH($B28, Ingredients_DB!$B$2:$B$501,0)),0))","v":0},{"$f":"IF($B28=\"\",\"\",IFERROR(INDEX(Ingredients_DB!$V$2:$V$501, MATCH($B28, Ingredients_DB!$B$2:$B$501,0)),0))","v":1},{"$f":"IF($B28=\"\",\"\",IFERROR(INDEX(Ingredients_DB!$W$2:$W$501, MATCH($B28, Ingredients_DB!$B$2:$B$501,0)),0))","v":0},{"$f":"IF($B28=\"\",\"\",IFERROR(INDEX(Ingredients_DB!$X$2:$X$501, MATCH($B28, Ingredients_DB!$B$2:$B$501,0)),0))","v":0},{"$f":"IF($B28=\"\",\"\",IFERROR(INDEX(Ingredients_DB!$Y$2:$Y$501, MATCH($B28, Ingredients_DB!$B$2:$B$501,0)),0))","v":0},{"$f":"IF($B28=\"\",\"\",IFERROR(INDEX(Ingredients_DB!$Z$2:$Z$501, MATCH($B28, Ingredients_DB!$B$2:$B$501,0)),0))","v":0}]
[9,null,{"v":0,"d":"0.00"},"g",null,"",{"$f":"IF($B29=\"\",\"\",IFERROR(INDEX(Ingredients_DB!$K$2:$K$501, MATCH($B29, Ingredients_DB!$B$2:$B$501,0)),0))","v":""},"",{"$nulls":6},{"$f":"IF($B29=\"\",\"\",IFERROR(INDEX(Ingredients_DB!$H$2:$H$501, MATCH($B29, Ingredients_DB!$B$2:$B$501,0)),\"\"))","v":""},{"$f":"IF($B29=\"\",\"\",IFERROR(INDEX(Ingredients_DB!$I$2:$I$501, MATCH($B29, Ingredients_DB!$B$2:$B$501,0)),\"\"))","v":""},{"$f":"IF($B29=\"\",\"\",IFERROR(VLOOKUP($O29&\"|\"&$D29,UOM_Conversions!$A$2:$E$50,4,FALSE),\"CHECK UNIT\"))","v":""},{"$f":"IF($B29=\"\",\"\",IFERROR(INDEX(Ingredients_DB!$M$2:$M$501, MATCH($B29, Ingredients_DB!$B$2:$B$501,0)),0))","v":""},{"$f":"IF($B29=\"\",\"\",IFERROR(INDEX(Ingredients_DB!$N$2:$N$501, MATCH($B29, Ingredients_DB!$B$2:$B$501,0)),0))","v":""},{"$f":"IF($B29=\"\",\"\",IFERROR(INDEX(Ingredients_DB!$O$2:$O$501, MATCH($B29, Ingredients_DB!$B$2:$B$501,0)),0))","v":""},{"$f":"IF($B29=\"\",\"\",IFERROR(INDEX(Ingredients_DB!$P$2:$P$501, MATCH($B29, Ingredients_DB!$B$2:$B$501,0)),0))","v":""},{"$f":"IF($B29=\"\",\"\",IFERROR(INDEX(Ingredients_DB!$Q$2:$Q$501, MATCH($B29, Ingredients_DB!$B$2:$B$501,0)),0))","v":""},{"$f":"IF($B29=\"\",\"\",IFERROR(INDEX(Ingredients_DB!$R$2:$R$501, MATCH($B29, Ingredients_DB!$B$2:$B$501,0)),0))","v":""},{"$f":"IF($B29=\"\",\"\",IFERROR(INDEX(Ingredients_DB!$S$2:$S$501, MATCH($B29, Ingredients_DB!$B$2:$B$501,0)),0))","v":""},{"$f":"IF($B29=\"\",\"\",IFERROR(INDEX(Ingredients_DB!$T$2:$T$501, MATCH($B29, Ingredients_DB!$B$2:$B$501,0)),0))","v":""},{"$f":"IF($B29=\"\",\"\",IFERROR(INDEX(Ingredients_DB!$U$2:$U$501, MATCH($B29, Ingredients_DB!$B$2:$B$501,0)),0))","v":""},{"$f":"IF($B29=\"\",\"\",IFERROR(INDEX(Ingredients_DB!$V$2:$V$501, MATCH($B29, Ingredients_DB!$B$2:$B$501,0)),0))","v":""},{"$f":"IF($B29=\"\",\"\",IFERROR(INDEX(Ingredients_DB!$W$2:$W$501, MATCH($B29, Ingredients_DB!$B$2:$B$501,0)),0))","v":""},{"$f":"IF($B29=\"\",\"\",IFERROR(INDEX(Ingredients_DB!$X$2:$X$501, MATCH($B29, Ingredients_DB!$B$2:$B$501,0)),0))","v":""},{"$f":"IF($B29=\"\",\"\",IFERROR(INDEX(Ingredients_DB!$Y$2:$Y$501, MATCH($B29, Ingredients_DB!$B$2:$B$501,0)),0))","v":""},{"$f":"IF($B29=\"\",\"\",IFERROR(INDEX(Ingredients_DB!$Z$2:$Z$501, MATCH($B29, Ingredients_DB!$B$2:$B$501,0)),0))","v":""}]
[10,null,{"v":0,"d":"0.00"},"g",null,"",{"$f":"IF($B30=\"\",\"\",IFERROR(INDEX(Ingredients_DB!$K$2:$K$501, MATCH($B30, Ingredients_DB!$B$2:$B$501,0)),0))","v":""},"",{"$nulls":6},{"$f":"IF($B30=\"\",\"\",IFERROR(INDEX(Ingredients_DB!$H$2:$H$501, MATCH($B30, Ingredients_DB!$B$2:$B$501,0)),\"\"))","v":""},{"$f":"IF($B30=\"\",\"\",IFERROR(INDEX(Ingredients_DB!$I$2:$I$501, MATCH($B30, Ingredients_DB!$B$2:$B$501,0)),\"\"))","v":""},{"$f":"IF($B30=\"\",\"\",IFERROR(VLOOKUP($O30&\"|\"&$D30,UOM_Conversions!$A$2:$E$50,4,FALSE),\"CHECK UNIT\"))","v":""},{"$f":"IF($B30=\"\",\"\",IFERROR(INDEX(Ingredients_DB!$M$2:$M$501, MATCH($B30, Ingredients_DB!$B$2:$B$501,0)),0))","v":""},{"$f":"IF($B30=\"\",\"\",IFERROR(INDEX(Ingredients_DB!$N$2:$N$501, MATCH($B30, Ingredients_DB!$B$2:$B$501,0)),0))","v":""},{"$f":"IF($B30=\"\",\"\",IFERROR(INDEX(Ingredients_DB!$O$2:$O$501, MATCH($B30, Ingredients_DB!$B$2:$B$501,0)),0))","v":""},{"$f":"IF($B30=\"\",\"\",IFERROR(INDEX(Ingredients_DB!$P$2:$P$501, MATCH($B30, Ingredients_DB!$B$2:$B$501,0)),0))","v":""},{"$f":"IF($B30=\"\",\"\",IFERROR(INDEX(Ingredients_DB!$Q$2:$Q$501, MATCH($B30, Ingredients_DB!$B$2:$B$501,0)),0))","v":""},{"$f":"IF($B30=\"\",\"\",IFERROR(INDEX(Ingredients_DB!$R$2:$R$501, MATCH($B30, Ingredients_DB!$B$2:$B$501,0)),0))","v":""},{"$f":"IF($B30=\"\",\"\",IFERROR(INDEX(Ingredients_DB!$S$2:$S$501, MATCH($B30, Ingredients_DB!$B$2:$B$501,0)),0))","v":""},{"$f":"IF($B30=\"\",\"\",IFERROR(INDEX(Ingredients_DB!$T$2:$T$501, MATCH($B30, Ingredients_DB!$B$2:$B$501,0)),0))","v":""},{"$f":"IF($B30=\"\",\"\",IFERROR(INDEX(Ingredients_DB!$U$2:$U$501, MATCH($B30, Ingredients_DB!$B$2:$B$501,0)),0))","v":""},{"$f":"IF($B30=\"\",\"\",IFERROR(INDEX(Ingredients_DB!$V$2:$V$501, MATCH($B30, Ingredients_DB!$B$2:$B$501,0)),0))","v":""},{"$f":"IF($B30=\"\",\"\",IFERROR(INDEX(Ingredients_DB!$W$2:$W$501, MATCH($B30, Ingredients_DB!$B$2:$B$501,0)),0))","v":""},{"$f":"IF($B30=\"\",\"\",IFERROR(INDEX(Ingredients_DB!$X$2:$X$501, MATCH($B30, Ingredients_DB!$B$2:$B$501,0)),0))","v":""},{"$f":"IF($B30=\"\",\"\",IFERROR(INDEX(Ingredients_DB!$Y$2:$Y$501, MATCH($B30, Ingredients_DB!$B$2:$B$501,0)),0))","v":""},{"$f":"IF($B30=\"\",\"\",IFERROR(INDEX(Ingredients_DB!$Z$2:$Z$501, MATCH($B30, Ingredients_DB!$B$2:$B$501,0)),0))","v":""}]
[11,null,{"v":0,"d":"0.00"},"g",null,"",{"$f":"IF($B31=\"\",\"\",IFERROR(INDEX(Ingredients_DB!$K$2:$K$501, MATCH($B31, Ingredients_DB!$B$2:$B$501,0)),0))","v":""},"",{"$nulls":6},{"$f":"IF($B31=\"\",\"\",IFERROR(INDEX(Ingredients_DB!$H$2:$H$501, MATCH($B31, Ingredients_DB!$B$2:$B$501,0)),\"\"))","v":""},{"$f":"IF($B31=\"\",\"\",IFERROR(INDEX(Ingredients_DB!$I$2:$I$501, MATCH($B31, Ingredients_DB!$B$2:$B$501,0)),\"\"))","v":""},{"$f":"IF($B31=\"\",\"\",IFERROR(VLOOKUP($O31&\"|\"&$D31,UOM_Conversions!$A$2:$E$50,4,FALSE),\"CHECK UNIT\"))","v":""},{"$f":"IF($B31=\"\",\"\",IFERROR(INDEX(Ingredients_DB!$M$2:$M$501, MATCH($B31, Ingredients_DB!$B$2:$B$501,0)),0))","v":""},{"$f":"IF($B31=\"\",\"\",IFERROR(INDEX(Ingredients_DB!$N$2:$N$501, MATCH($B31, Ingredients_DB!$B$2:$B$501,0)),0))","v":""},{"$f":"IF($B31=\"\",\"\",IFERROR(INDEX(Ingredients_DB!$O$2:$O$501, MATCH($B31, Ingredients_DB!$B$2:$B$501,0)),0))","v":""},{"$f":"IF($B31=\"\",\"\",IFERROR(INDEX(Ingredients_DB!$P$2:$P$501, MATCH($B31, Ingredients_DB!$B$2:$B$501,0)),0))","v":""},{"$f":"IF($B31=\"\",\"\",IFERROR(INDEX(Ingredients_DB!$Q$2:$Q$501, MATCH($B31, Ingredients_DB!$B$2:$B$501,0)),0))","v":""},{"$f":"IF($B31=\"\",\"\",IFERROR(INDEX(Ingredients_DB!$R$2:$R$501, MATCH($B31, Ingredients_DB!$B$2:$B$501,0)),0))","v":""},{"$f":"IF($B31=\"\",\"\",IFERROR(INDEX(Ingredients_DB!$S$2:$S$501, MATCH($B31, Ingredients_DB!$B$2:$B$501,0)),0))","v":""},{"$f":"IF($B31=\"\",\"\",IFERROR(INDEX(Ingredients_DB!$T$2:$T$501, MATCH($B31, Ingredients_DB!$B$2:$B$501,0)),0))","v":""},{"$f":"IF($B31=\"\",\"\",IFERROR(INDEX(Ingredients_DB!$U$2:$U$501, MATCH($B31, Ingredients_DB!$B$2:$B$501,0)),0))","v":""},{"$f":"IF($B31=\"\",\"\",IFERROR(INDEX(Ingredients_DB!$V$2:$V$501, MATCH($B31, Ingredients_DB!$B$2:$B$501,0)),0))","v":""},{"$f":"IF($B31=\"\",\"\",IFERROR(INDEX(Ingredients_DB!$W$2:$W$501, MATCH($B31, Ingredients_DB!$B$2:$B$501,0)),0))","v":""},{"$f":"IF($B31=\"\",\"\",IFERROR(INDEX(Ingredients_DB!$X$2:$X$501, MATCH($B31, Ingredients_DB!$B$2:$B$501,0)),0))","v":""},{"$f":"IF($B31=\"\",\"\",IFERROR(INDEX(Ingredients_DB!$Y$2:$Y$501, MATCH($B31, Ingredients_DB!$B$2:$B$501,0)),0))","v":""},{"$f":"IF($B31=\"\",\"\",IFERROR(INDEX(Ingredients_DB!$Z$2:$Z$501, MATCH($B31, Ingredients_DB!$B$2:$B$501,0)),0))","v":""}]
[12,null,{"v":0,"d":"0.00"},"g",null,"",{"$f":"IF($B32=\"\",\"\",IFERROR(INDEX(Ingredients_DB!$K$2:$K$501, MATCH($B32, Ingredients_DB!$B$2:$B$501,0)),0))","v":""},"",{"$nulls":6},{"$f":"IF($B32=\"\",\"\",IFERROR(INDEX(Ingredients_DB!$H$2:$H$501, MATCH($B32, Ingredients_DB!$B$2:$B$501,0)),\"\"))","v":""},{"$f":"IF($B32=\"\",\"\",IFERROR(INDEX(Ingredients_DB!$I$2:$I$501, MATCH($B32, Ingredients_DB!$B$2:$B$501,0)),\"\"))","v":""},{"$f":"IF($B32=\"\",\"\",IFERROR(VLOOKUP($O32&\"|\"&$D32,UOM_Conversions!$A$2:$E$50,4,FALSE),\"CHECK UNIT\"))","v":""},{"$f":"IF($B32=\"\",\"\",IFERROR(INDEX(Ingredients_DB!$M$2:$M$501, MATCH($B32, Ingredients_DB!$B$2:$B$501,0)),0))","v":""},{"$f":"IF($B32=\"\",\"\",IFERROR(INDEX(Ingredients_DB!$N$2:$N$501, MATCH($B32, Ingredients_DB!$B$2:$B$501,0)),0))","v":""},{"$f":"IF($B32=\"\",\"\",IFERROR(INDEX(Ingredients_DB!$O$2:$O$501, MATCH($B32, Ingredients_DB!$B$2:$B$501,0)),0))","v":""},{"$f":"IF($B32=\"\",\"\",IFERROR(INDEX(Ingredients_DB!$P$2:$P$501, MATCH($B32, Ingredients_DB!$B$2:$B$501,0)),0))","v":""},{"$f":"IF($B32=\"\",\"\",IFERROR(INDEX(Ingredients_DB!$Q$2:$Q$501, MATCH($B32, Ingredients_DB!$B$2:$B$501,0)),0))","v":""},{"$f":"IF($B32=\"\",\"\",IFERROR(INDEX(Ingredients_DB!$R$2:$R$501, MATCH($B32, Ingredients_DB!$B$2:$B$501,0)),0))","v":""},{"$f":"IF($B32=\"\",\"\",IFERROR(INDEX(Ingredients_DB!$S$2:$S$501, MATCH($B32, Ingredients_DB!$B$2:$B$501,0)),0))","v":""},{"$f":"IF($B32=\"\",\"\",IFERROR(INDEX(Ingredients_DB!$T$2:$T$501, MATCH($B32, Ingredients_DB!$B$2:$B$501,0)),0))","v":""},{"$f":"IF($B32=\"\",\"\",IFERROR(INDEX(Ingredients_DB!$U$2:$U$501, MATCH($B32, Ingredients_DB!$B$2:$B$501,0)),0))","v":""},{"$f":"IF($B32=\"\",\"\",IFERROR(INDEX(Ingredients_DB!$V$2:$V$501, MATCH($B32, Ingredients_DB!$B$2:$B$501,0)),0))","v":""},{"$f":"IF($B32=\"\",\"\",IFERROR(INDEX(Ingredients_DB!$W$2:$W$501, MATCH($B32, Ingredients_DB!$B$2:$B$501,0)),0))","v":""},{"$f":"IF($B32=\"\",\"\",IFERROR(INDEX(Ingredients_DB!$X$2:$X$501, MATCH($B32, Ingredients_DB!$B$2:$B$501,0)),0))","v":""},{"$f":"IF($B32=\"\",\"\",IFERROR(INDEX(Ingredients_DB!$Y$2:$Y$501, MATCH($B32, Ingredients_DB!$B$2:$B$501,0)),0))","v":""},{"$f":"IF($B32=\"\",\"\",IFERROR(INDEX(Ingredients_DB!$Z$2:$Z$501, MATCH($B32, Ingredients_DB!$B$2:$B$501,0)),0))","v":""}]
[13,null,{"v":0,"d":"0.00"},"g",null,"",{"$f":"IF($B33=\"\",\"\",IFERROR(INDEX(Ingredients_DB!$K$2:$K$501, MATCH($B33, Ingredients_DB!$B$2:$B$501,0)),0))","v":""},"",{"$nulls":6},{"$f":"IF($B33=\"\",\"\",IFERROR(INDEX(Ingredients_DB!$H$2:$H$501, MATCH($B33, Ingredients_DB!$B$2:$B$501,0)),\"\"))","v":""},{"$f":"IF($B33=\"\",\"\",IFERROR(INDEX(Ingredients_DB!$I$2:$I$501, MATCH($B33, Ingredients_DB!$B$2:$B$501,0)),\"\"))","v":""},{"$f":"IF($B33=\"\",\"\",IFERROR(VLOOKUP($O33&\"|\"&$D33,UOM_Conversions!$A$2:$E$50,4,FALSE),\"CHECK UNIT\"))","v":""},{"$f":"IF($B33=\"\",\"\",IFERROR(INDEX(Ingredients_DB!$M$2:$M$501, MATCH($B33, Ingredients_DB!$B$2:$B$501,0)),0))","v":""},{"$f":"IF($B33=\"\",\"\",IFERROR(INDEX(Ingredients_DB!$N$2:$N$501, MATCH($B33, Ingredients_DB!$B$2:$B$501,0)),0))","v":""},{"$f":"IF($B33=\"\",\"\",IFERROR(INDEX(Ingredients_DB!$O$2:$O$501, MATCH($B33, Ingredients_DB!$B$2:$B$501,0)),0))","v":""},{"$f":"IF($B33=\"\",\"\",IFERROR(INDEX(Ingredients_DB!$P$2:$P$501, MATCH($B33, Ingredients_DB!$B$2:$B$501,0)),0))","v":""},{"$f":"IF($B33=\"\",\"\",IFERROR(INDEX(Ingredients_DB!$Q$2:$Q$501, MATCH($B33, Ingredients_DB!$B$2:$B$501,0)),0))","v":""},{"$f":"IF($B33=\"\",\"\",IFERROR(INDEX(Ingredients_DB!$R$2:$R$501, MATCH($B33, Ingredients_DB!$B$2:$B$501,0)),0))","v":""},{"$f":"IF($B33=\"\",\"\",IFERROR(INDEX(Ingredients_DB!$S$2:$S$501, MATCH($B33, Ingredients_DB!$B$2:$B$501,0)),0))","v":""},{"$f":"IF($B33=\"\",\"\",IFERROR(INDEX(Ingredients_DB!$T$2:$T$501, MATCH($B33, Ingredients_DB!$B$2:$B$501,0)),0))","v":""},{"$f":"IF($B33=\"\",\"\",IFERROR(INDEX(Ingredients_DB!$U$2:$U$501, MATCH($B33, Ingredients_DB!$B$2:$B$501,0)),0))","v":""},{"$f":"IF($B33=\"\",\"\",IFERROR(INDEX(Ingredients_DB!$V$2:$V$501, MATCH($B33, Ingredients_DB!$B$2:$B$501,0)),0))","v":""},{"$f":"IF($B33=\"\",\"\",IFERROR(INDEX(Ingredients_DB!$W$2:$W$501, MATCH($B33, Ingredients_DB!$B$2:$B$501,0)),0))","v":""},{"$f":"IF($B33=\"\",\"\",IFERROR(INDEX(Ingredients_DB!$X$2:$X$501, MATCH($B33, Ingredients_DB!$B$2:$B$501,0)),0))","v":""},{"$f":"IF($B33=\"\",\"\",IFERROR(INDEX(Ingredients_DB!$Y$2:$Y$501, MATCH($B33, Ingredients_DB!$B$2:$B$501,0)),0))","v":""},{"$f":"IF($B33=\"\",\"\",IFERROR(INDEX(Ingredients_DB!$Z$2:$Z$501, MATCH($B33, Ingredients_DB!$B$2:$B$501,0)),0))","v":""}]
[14,null,{"v":0,"d":"0.00"},"g",null,"",{"$f":"IF($B34=\"\",\"\",IFERROR(INDEX(Ingredients_DB!$K$2:$K$501, MATCH($B34, Ingredients_DB!$B$2:$B$501,0)),0))","v":""},"",{"$nulls":6},{"$f":"IF($B34=\"\",\"\",IFERROR(INDEX(Ingredients_DB!$H$2:$H$501, MATCH($B34, Ingredients_DB!$B$2:$B$501,0)),\"\"))","v":""},{"$f":"IF($B34=\"\",\"\",IFERROR(INDEX(Ingredients_DB!$I$2:$I$501, MATCH($B34, Ingredients_DB!$B$2:$B$501,0)),\"\"))","v":""},{"$f":"IF($B34=\"\",\"\",IFERROR(VLOOKUP($O34&\"|\"&$D34,UOM_Conversions!$A$2:$E$50,4,FALSE),\"CHECK UNIT\"))","v":""},{"$f":"IF($B34=\"\",\"\",IFERROR(INDEX(Ingredients_DB!$M$2:$M$501, MATCH($B34, Ingredients_DB!$B$2:$B$501,0)),0))","v":""},{"$f":"IF($B34=\"\",\"\",IFERROR(INDEX(Ingredients_DB!$N$2:$N$501, MATCH($B34, Ingredients_DB!$B$2:$B$501,0)),0))","v":""},{"$f":"IF($B34=\"\",\"\",IFERROR(INDEX(Ingredients_DB!$O$2:$O$501, MATCH($B34, Ingredients_DB!$B$2:$B$501,0)),0))","v":""},{"$f":"IF($B34=\"\",\"\",IFERROR(INDEX(Ingredients_DB!$P$2:$P$501, MATCH($B34, Ingredients_DB!$B$2:$B$501,0)),0))","v":""},{"$f":"IF($B34=\"\",\"\",IFERROR(INDEX(Ingredients_DB!$Q$2:$Q$501, MATCH($B34, Ingredients_DB!$B$2:$B$501,0)),0))","v":""},{"$f":"IF($B34=\"\",\"\",IFERROR(INDEX(Ingredients_DB!$R$2:$R$501, MATCH($B34, Ingredients_DB!$B$2:$B$501,0)),0))","v":""},{"$f":"IF($B34=\"\",\"\",IFERROR(INDEX(Ingredients_DB!$S$2:$S$501, MATCH($B34, Ingredients_DB!$B$2:$B$501,0)),0))","v":""},{"$f":"IF($B34=\"\",\"\",IFERROR(INDEX(Ingredients_DB!$T$2:$T$501, MATCH($B34, Ingredients_DB!$B$2:$B$501,0)),0))","v":""},{"$f":"IF($B34=\"\",\"\",IFERROR(INDEX(Ingredients_DB!$U$2:$U$501, MATCH($B34, Ingredients_DB!$B$2:$B$501,0)),0))","v":""},{"$f":"IF($B34=\"\",\"\",IFERROR(INDEX(Ingredients_DB!$V$2:$V$501, MATCH($B34, Ingredients_DB!$B$2:$B$501,0)),0))","v":""},{"$f":"IF($B34=\"\",\"\",IFERROR(INDEX(Ingredients_DB!$W$2:$W$501, MATCH($B34, Ingredients_DB!$B$2:$B$501,0)),0))","v":""},{"$f":"IF($B34=\"\",\"\",IFERROR(INDEX(Ingredients_DB!$X$2:$X$501, MATCH($B34, Ingredients_DB!$B$2:$B$501,0)),0))","v":""},{"$f":"IF($B34=\"\",\"\",IFERROR(INDEX(Ingredients_DB!$Y$2:$Y$501, MATCH($B34, Ingredients_DB!$B$2:$B$501,0)),0))","v":""},{"$f":"IF($B34=\"\",\"\",IFERROR(INDEX(Ingredients_DB!$Z$2:$Z$501, MATCH($B34, Ingredients_DB!$B$2:$B$501,0)),0))","v":""}]
[15,null,{"v":0,"d":"0.00"},"g",null,"",{"$f":"IF($B35=\"\",\"\",IFERROR(INDEX(Ingredients_DB!$K$2:$K$501, MATCH($B35, Ingredients_DB!$B$2:$B$501,0)),0))","v":""},"",{"$nulls":6},{"$f":"IF($B35=\"\",\"\",IFERROR(INDEX(Ingredients_DB!$H$2:$H$501, MATCH($B35, Ingredients_DB!$B$2:$B$501,0)),\"\"))","v":""},{"$f":"IF($B35=\"\",\"\",IFERROR(INDEX(Ingredients_DB!$I$2:$I$501, MATCH($B35, Ingredients_DB!$B$2:$B$501,0)),\"\"))","v":""},{"$f":"IF($B35=\"\",\"\",IFERROR(VLOOKUP($O35&\"|\"&$D35,UOM_Conversions!$A$2:$E$50,4,FALSE),\"CHECK UNIT\"))","v":""},{"$f":"IF($B35=\"\",\"\",IFERROR(INDEX(Ingredients_DB!$M$2:$M$501, MATCH($B35, Ingredients_DB!$B$2:$B$501,0)),0))","v":""},{"$f":"IF($B35=\"\",\"\",IFERROR(INDEX(Ingredients_DB!$N$2:$N$501, MATCH($B35, Ingredients_DB!$B$2:$B$501,0)),0))","v":""},{"$f":"IF($B35=\"\",\"\",IFERROR(INDEX(Ingredients_DB!$O$2:$O$501, MATCH($B35, Ingredients_DB!$B$2:$B$501,0)),0))","v":""},{"$f":"IF($B35=\"\",\"\",IFERROR(INDEX(Ingredients_DB!$P$2:$P$501, MATCH($B35, Ingredients_DB!$B$2:$B$501,0)),0))","v":""},{"$f":"IF($B35=\"\",\"\",IFERROR(INDEX(Ingredients_DB!$Q$2:$Q$501, MATCH($B35, Ingredients_DB!$B$2:$B$501,0)),0))","v":""},{"$f":"IF($B35=\"\",\"\",IFERROR(INDEX(Ingredients_DB!$R$2:$R$501, MATCH($B35, Ingredients_DB!$B$2:$B$501,0)),0))","v":""},{"$f":"IF($B35=\"\",\"\",IFERROR(INDEX(Ingredients_DB!$S$2:$S$501, MATCH($B35, Ingredients_DB!$B$2:$B$501,0)),0))","v":""},{"$f":"IF($B35=\"\",\"\",IFERROR(INDEX(Ingredients_DB!$T$2:$T$501, MATCH($B35, Ingredients_DB!$B$2:$B$501,0)),0))","v":""},{"$f":"IF($B35=\"\",\"\",IFERROR(INDEX(Ingredients_DB!$U$2:$U$501, MATCH($B35, Ingredients_DB!$B$2:$B$501,0)),0))","v":""},{"$f":"IF($B35=\"\",\"\",IFERROR(INDEX(Ingredients_DB!$V$2:$V$501, MATCH($B35, Ingredients_DB!$B$2:$B$501,0)),0))","v":""},{"$f":"IF($B35=\"\",\"\",IFERROR(INDEX(Ingredients_DB!$W$2:$W$501, MATCH($B35, Ingredients_DB!$B$2:$B$501,0)),0))","v":""},{"$f":"IF($B35=\"\",\"\",IFERROR(INDEX(Ingredients_DB!$X$2:$X$501, MATCH($B35, Ingredients_DB!$B$2:$B$501,0)),0))","v":""},{"$f":"IF($B35=\"\",\"\",IFERROR(INDEX(Ingredients_DB!$Y$2:$Y$501, MATCH($B35, Ingredients_DB!$B$2:$B$501,0)),0))","v":""},{"$f":"IF($B35=\"\",\"\",IFERROR(INDEX(Ingredients_DB!$Z$2:$Z$501, MATCH($B35, Ingredients_DB!$B$2:$B$501,0)),0))","v":""}]
[16,null,{"v":0,"d":"0.00"},"g",null,"",{"$f":"IF($B36=\"\",\"\",IFERROR(INDEX(Ingredients_DB!$K$2:$K$501, MATCH($B36, Ingredients_DB!$B$2:$B$501,0)),0))","v":""},"",{"$nulls":6},{"$f":"IF($B36=\"\",\"\",IFERROR(INDEX(Ingredients_DB!$H$2:$H$501, MATCH($B36, Ingredients_DB!$B$2:$B$501,0)),\"\"))","v":""},{"$f":"IF($B36=\"\",\"\",IFERROR(INDEX(Ingredients_DB!$I$2:$I$501, MATCH($B36, Ingredients_DB!$B$2:$B$501,0)),\"\"))","v":""},{"$f":"IF($B36=\"\",\"\",IFERROR(VLOOKUP($O36&\"|\"&$D36,UOM_Conversions!$A$2:$E$50,4,FALSE),\"CHECK UNIT\"))","v":""},{"$f":"IF($B36=\"\",\"\",IFERROR(INDEX(Ingredients_DB!$M$2:$M$501, MATCH($B36, Ingredients_DB!$B$2:$B$501,0)),0))","v":""},{"$f":"IF($B36=\"\",\"\",IFERROR(INDEX(Ingredients_DB!$N$2:$N$501, MATCH($B36, Ingredients_DB!$B$2:$B$501,0)),0))","v":""},{"$f":"IF($B36=\"\",\"\",IFERROR(INDEX(Ingredients_DB!$O$2:$O$501, MATCH($B36, Ingredients_DB!$B$2:$B$501,0)),0))","v":""},{"$f":"IF($B36=\"\",\"\",IFERROR(INDEX(Ingredients_DB!$P$2:$P$501, MATCH($B36, Ingredients_DB!$B$2:$B$501,0)),0))","v":""},{"$f":"IF($B36=\"\",\"\",IFERROR(INDEX(Ingredients_DB!$Q$2:$Q$501, MATCH($B36, Ingredients_DB!$B$2:$B$501,0)),0))","v":""},{"$f":"IF($B36=\"\",\"\",IFERROR(INDEX(Ingredients_DB!$R$2:$R$501, MATCH($B36, Ingredients_DB!$B$2:$B$501,0)),0))","v":""},{"$f":"IF($B36=\"\",\"\",IFERROR(INDEX(Ingredients_DB!$S$2:$S$501, MATCH($B36, Ingredients_DB!$B$2:$B$501,0)),0))","v":""},{"$f":"IF($B36=\"\",\"\",IFERROR(INDEX(Ingredients_DB!$T$2:$T$501, MATCH($B36, Ingredients_DB!$B$2:$B$501,0)),0))","v":""},{"$f":"IF($B36=\"\",\"\",IFERROR(INDEX(Ingredients_DB!$U$2:$U$501, MATCH($B36, Ingredients_DB!$B$2:$B$501,0)),0))","v":""},{"$f":"IF($B36=\"\",\"\",IFERROR(INDEX(Ingredients_DB!$V$2:$V$501, MATCH($B36, Ingredients_DB!$B$2:$B$501,0)),0))","v":""},{"$f":"IF($B36=\"\",\"\",IFERROR(INDEX(Ingredients_DB!$W$2:$W$501, MATCH($B36, Ingredients_DB!$B$2:$B$501,0)),0))","v":""},{"$f":"IF($B36=\"\",\"\",IFERROR(INDEX(Ingredients_DB!$X$2:$X$501, MATCH($B36, Ingredients_DB!$B$2:$B$501,0)),0))","v":""},{"$f":"IF($B36=\"\",\"\",IFERROR(INDEX(Ingredients_DB!$Y$2:$Y$501, MATCH($B36, Ingredients_DB!$B$2:$B$501,0)),0))","v":""},{"$f":"IF($B36=\"\",\"\",IFERROR(INDEX(Ingredients_DB!$Z$2:$Z$501, MATCH($B36, Ingredients_DB!$B$2:$B$501,0)),0))","v":""}]
[17,null,{"v":0,"d":"0.00"},"g",null,"",{"$f":"IF($B37=\"\",\"\",IFERROR(INDEX(Ingredients_DB!$K$2:$K$501, MATCH($B37, Ingredients_DB!$B$2:$B$501,0)),0))","v":""},"",{"$nulls":6},{"$f":"IF($B37=\"\",\"\",IFERROR(INDEX(Ingredients_DB!$H$2:$H$501, MATCH($B37, Ingredients_DB!$B$2:$B$501,0)),\"\"))","v":""},{"$f":"IF($B37=\"\",\"\",IFERROR(INDEX(Ingredients_DB!$I$2:$I$501, MATCH($B37, Ingredients_DB!$B$2:$B$501,0)),\"\"))","v":""},{"$f":"IF($B37=\"\",\"\",IFERROR(VLOOKUP($O37&\"|\"&$D37,UOM_Conversions!$A$2:$E$50,4,FALSE),\"CHECK UNIT\"))","v":""},{"$f":"IF($B37=\"\",\"\",IFERROR(INDEX(Ingredients_DB!$M$2:$M$501, MATCH($B37, Ingredients_DB!$B$2:$B$501,0)),0))","v":""},{"$f":"IF($B37=\"\",\"\",IFERROR(INDEX(Ingredients_DB!$N$2:$N$501, MATCH($B37, Ingredients_DB!$B$2:$B$501,0)),0))","v":""},{"$f":"IF($B37=\"\",\"\",IFERROR(INDEX(Ingredients_DB!$O$2:$O$501, MATCH($B37, Ingredients_DB!$B$2:$B$501,0)),0))","v":""},{"$f":"IF($B37=\"\",\"\",IFERROR(INDEX(Ingredients_DB!$P$2:$P$501, MATCH($B37, Ingredients_DB!$B$2:$B$501,0)),0))","v":""},{"$f":"IF($B37=\"\",\"\",IFERROR(INDEX(Ingredients_DB!$Q$2:$Q$501, MATCH($B37, Ingredients_DB!$B$2:$B$501,0)),0))","v":""},{"$f":"IF($B37=\"\",\"\",IFERROR(INDEX(Ingredients_DB!$R$2:$R$501, MATCH($B37, Ingredients_DB!$B$2:$B$501,0)),0))","v":""},{"$f":"IF($B37=\"\",\"\",IFERROR(INDEX(Ingredients_DB!$S$2:$S$501, MATCH($B37, Ingredients_DB!$B$2:$B$501,0)),0))","v":""},{"$f":"IF($B37=\"\",\"\",IFERROR(INDEX(Ingredients_DB!$T$2:$T$501, MATCH($B37, Ingredients_DB!$B$2:$B$501,0)),0))","v":""},{"$f":"IF($B37=\"\",\"\",IFERROR(INDEX(Ingredients_DB!$U$2:$U$501, MATCH($B37, Ingredients_DB!$B$2:$B$501,0)),0))","v":""},{"$f":"IF($B37=\"\",\"\",IFERROR(INDEX(Ingredients_DB!$V$2:$V$501, MATCH($B37, Ingredients_DB!$B$2:$B$501,0)),0))","v":""},{"$f":"IF($B37=\"\",\"\",IFERROR(INDEX(Ingredients_DB!$W$2:$W$501, MATCH($B37, Ingredients_DB!$B$2:$B$501,0)),0))","v":""},{"$f":"IF($B37=\"\",\"\",IFERROR(INDEX(Ingredients_DB!$X$2:$X$501, MATCH($B37, Ingredients_DB!$B$2:$B$501,0)),0))","v":""},{"$f":"IF($B37=\"\",\"\",IFERROR(INDEX(Ingredients_DB!$Y$2:$Y$501, MATCH($B37, Ingredients_DB!$B$2:$B$501,0)),0))","v":""},{"$f":"IF($B37=\"\",\"\",IFERROR(INDEX(Ingredients_DB!$Z$2:$Z$501, MATCH($B37, Ingredients_DB!$B$2:$B$501,0)),0))","v":""}]
[18,null,{"v":0,"d":"0.00"},"g",null,"",{"$f":"IF($B38=\"\",\"\",IFERROR(INDEX(Ingredients_DB!$K$2:$K$501, MATCH($B38, Ingredients_DB!$B$2:$B$501,0)),0))","v":""},"",{"$nulls":6},{"$f":"IF($B38=\"\",\"\",IFERROR(INDEX(Ingredients_DB!$H$2:$H$501, MATCH($B38, Ingredients_DB!$B$2:$B$501,0)),\"\"))","v":""},{"$f":"IF($B38=\"\",\"\",IFERROR(INDEX(Ingredients_DB!$I$2:$I$501, MATCH($B38, Ingredients_DB!$B$2:$B$501,0)),\"\"))","v":""},{"$f":"IF($B38=\"\",\"\",IFERROR(VLOOKUP($O38&\"|\"&$D38,UOM_Conversions!$A$2:$E$50,4,FALSE),\"CHECK UNIT\"))","v":""},{"$f":"IF($B38=\"\",\"\",IFERROR(INDEX(Ingredients_DB!$M$2:$M$501, MATCH($B38, Ingredients_DB!$B$2:$B$501,0)),0))","v":""},{"$f":"IF($B38=\"\",\"\",IFERROR(INDEX(Ingredients_DB!$N$2:$N$501, MATCH($B38, Ingredients_DB!$B$2:$B$501,0)),0))","v":""},{"$f":"IF($B38=\"\",\"\",IFERROR(INDEX(Ingredients_DB!$O$2:$O$501, MATCH($B38, Ingredients_DB!$B$2:$B$501,0)),0))","v":""},{"$f":"IF($B38=\"\",\"\",IFERROR(INDEX(Ingredients_DB!$P$2:$P$501, MATCH($B38, Ingredients_DB!$B$2:$B$501,0)),0))","v":""},{"$f":"IF($B38=\"\",\"\",IFERROR(INDEX(Ingredients_DB!$Q$2:$Q$501, MATCH($B38, Ingredients_DB!$B$2:$B$501,0)),0))","v":""},{"$f":"IF($B38=\"\",\"\",IFERROR(INDEX(Ingredients_DB!$R$2:$R$501, MATCH($B38, Ingredients_DB!$B$2:$B$501,0)),0))","v":""},{"$f":"IF($B38=\"\",\"\",IFERROR(INDEX(Ingredients_DB!$S$2:$S$501, MATCH($B38, Ingredients_DB!$B$2:$B$501,0)),0))","v":""},{"$f":"IF($B38=\"\",\"\",IFERROR(INDEX(Ingredients_DB!$T$2:$T$501, MATCH($B38, Ingredients_DB!$B$2:$B$501,0)),0))","v":""},{"$f":"IF($B38=\"\",\"\",IFERROR(INDEX(Ingredients_DB!$U$2:$U$501, MATCH($B38, Ingredients_DB!$B$2:$B$501,0)),0))","v":""},{"$f":"IF($B38=\"\",\"\",IFERROR(INDEX(Ingredients_DB!$V$2:$V$501, MATCH($B38, Ingredients_DB!$B$2:$B$501,0)),0))","v":""},{"$f":"IF($B38=\"\",\"\",IFERROR(INDEX(Ingredients_DB!$W$2:$W$501, MATCH($B38, Ingredients_DB!$B$2:$B$501,0)),0))","v":""},{"$f":"IF($B38=\"\",\"\",IFERROR(INDEX(Ingredients_DB!$X$2:$X$501, MATCH($B38, Ingredients_DB!$B$2:$B$501,0)),0))","v":""},{"$f":"IF($B38=\"\",\"\",IFERROR(INDEX(Ingredients_DB!$Y$2:$Y$501, MATCH($B38, Ingredients_DB!$B$2:$B$501,0)),0))","v":""},{"$f":"IF($B38=\"\",\"\",IFERROR(INDEX(Ingredients_DB!$Z$2:$Z$501, MATCH($B38, Ingredients_DB!$B$2:$B$501,0)),0))","v":""}]
[19,null,{"v":0,"d":"0.00"},"g",null,"",{"$f":"IF($B39=\"\",\"\",IFERROR(INDEX(Ingredients_DB!$K$2:$K$501, MATCH($B39, Ingredients_DB!$B$2:$B$501,0)),0))","v":""},"",{"$nulls":6},{"$f":"IF($B39=\"\",\"\",IFERROR(INDEX(Ingredients_DB!$H$2:$H$501, MATCH($B39, Ingredients_DB!$B$2:$B$501,0)),\"\"))","v":""},{"$f":"IF($B39=\"\",\"\",IFERROR(INDEX(Ingredients_DB!$I$2:$I$501, MATCH($B39, Ingredients_DB!$B$2:$B$501,0)),\"\"))","v":""},{"$f":"IF($B39=\"\",\"\",IFERROR(VLOOKUP($O39&\"|\"&$D39,UOM_Conversions!$A$2:$E$50,4,FALSE),\"CHECK UNIT\"))","v":""},{"$f":"IF($B39=\"\",\"\",IFERROR(INDEX(Ingredients_DB!$M$2:$M$501, MATCH($B39, Ingredients_DB!$B$2:$B$501,0)),0))","v":""},{"$f":"IF($B39=\"\",\"\",IFERROR(INDEX(Ingredients_DB!$N$2:$N$501, MATCH($B39, Ingredients_DB!$B$2:$B$501,0)),0))","v":""},{"$f":"IF($B39=\"\",\"\",IFERROR(INDEX(Ingredients_DB!$O$2:$O$501, MATCH($B39, Ingredients_DB!$B$2:$B$501,0)),0))","v":""},{"$f":"IF($B39=\"\",\"\",IFERROR(INDEX(Ingredients_DB!$P$2:$P$501, MATCH($B39, Ingredients_DB!$B$2:$B$501,0)),0))","v":""},{"$f":"IF($B39=\"\",\"\",IFERROR(INDEX(Ingredients_DB!$Q$2:$Q$501, MATCH($B39, Ingredients_DB!$B$2:$B$501,0)),0))","v":""},{"$f":"IF($B39=\"\",\"\",IFERROR(INDEX(Ingredients_DB!$R$2:$R$501, MATCH($B39, Ingredients_DB!$B$2:$B$501,0)),0))","v":""},{"$f":"IF($B39=\"\",\"\",IFERROR(INDEX(Ingredients_DB!$S$2:$S$501, MATCH($B39, Ingredients_DB!$B$2:$B$501,0)),0))","v":""},{"$f":"IF($B39=\"\",\"\",IFERROR(INDEX(Ingredients_DB!$T$2:$T$501, MATCH($B39, Ingredients_DB!$B$2:$B$501,0)),0))","v":""},{"$f":"IF($B39=\"\",\"\",IFERROR(INDEX(Ingredients_DB!$U$2:$U$501, MATCH($B39, Ingredients_DB!$B$2:$B$501,0)),0))","v":""},{"$f":"IF($B39=\"\",\"\",IFERROR(INDEX(Ingredients_DB!$V$2:$V$501, MATCH($B39, Ingredients_DB!$B$2:$B$501,0)),0))","v":""},{"$f":"IF($B39=\"\",\"\",IFERROR(INDEX(Ingredients_DB!$W$2:$W$501, MATCH($B39, Ingredients_DB!$B$2:$B$501,0)),0))","v":""},{"$f":"IF($B39=\"\",\"\",IFERROR(INDEX(Ingredients_DB!$X$2:$X$501, MATCH($B39, Ingredients_DB!$B$2:$B$501,0)),0))","v":""},{"$f":"IF($B39=\"\",\"\",IFERROR(INDEX(Ingredients_DB!$Y$2:$Y$501, MATCH($B39, Ingredients_DB!$B$2:$B$501,0)),0))","v":""},{"$f":"IF($B39=\"\",\"\",IFERROR(INDEX(Ingredients_DB!$Z$2:$Z$501, MATCH($B39, Ingredients_DB!$B$2:$B$501,0)),0))","v":""}]
[20,null,{"v":0,"d":"0.00"},"g",null,"",{"$f":"IF($B40=\"\",\"\",IFERROR(INDEX(Ingredients_DB!$K$2:$K$501, MATCH($B40, Ingredients_DB!$B$2:$B$501,0)),0))","v":""},"",{"$nulls":6},{"$f":"IF($B40=\"\",\"\",IFERROR(INDEX(Ingredients_DB!$H$2:$H$501, MATCH($B40, Ingredients_DB!$B$2:$B$501,0)),\"\"))","v":""},{"$f":"IF($B40=\"\",\"\",IFERROR(INDEX(Ingredients_DB!$I$2:$I$501, MATCH($B40, Ingredients_DB!$B$2:$B$501,0)),\"\"))","v":""},{"$f":"IF($B40=\"\",\"\",IFERROR(VLOOKUP($O40&\"|\"&$D40,UOM_Conversions!$A$2:$E$50,4,FALSE),\"CHECK UNIT\"))","v":""},{"$f":"IF($B40=\"\",\"\",IFERROR(INDEX(Ingredients_DB!$M$2:$M$501, MATCH($B40, Ingredients_DB!$B$2:$B$501,0)),0))","v":""},{"$f":"IF($B40=\"\",\"\",IFERROR(INDEX(Ingredients_DB!$N$2:$N$501, MATCH($B40, Ingredients_DB!$B$2:$B$501,0)),0))","v":""},{"$f":"IF($B40=\"\",\"\",IFERROR(INDEX(Ingredients_DB!$O$2:$O$501, MATCH($B40, Ingredients_DB!$B$2:$B$501,0)),0))","v":""},{"$f":"IF($B40=\"\",\"\",IFERROR(INDEX(Ingredients_DB!$P$2:$P$501, MATCH($B40, Ingredients_DB!$B$2:$B$501,0)),0))","v":""},{"$f":"IF($B40=\"\",\"\",IFERROR(INDEX(Ingredients_DB!$Q$2:$Q$501, MATCH($B40, Ingredients_DB!$B$2:$B$501,0)),0))","v":""},{"$f":"IF($B40=\"\",\"\",IFERROR(INDEX(Ingredients_DB!$R$2:$R$501, MATCH($B40, Ingredients_DB!$B$2:$B$501,0)),0))","v":""},{"$f":"IF($B40=\"\",\"\",IFERROR(INDEX(Ingredients_DB!$S$2:$S$501, MATCH($B40, Ingredients_DB!$B$2:$B$501,0)),0))","v":""},{"$f":"IF($B40=\"\",\"\",IFERROR(INDEX(Ingredients_DB!$T$2:$T$501, MATCH($B40, Ingredients_DB!$B$2:$B$501,0)),0))","v":""},{"$f":"IF($B40=\"\",\"\",IFERROR(INDEX(Ingredients_DB!$U$2:$U$501, MATCH($B40, Ingredients_DB!$B$2:$B$501,0)),0))","v":""},{"$f":"IF($B40=\"\",\"\",IFERROR(INDEX(Ingredients_DB!$V$2:$V$501, MATCH($B40, Ingredients_DB!$B$2:$B$501,0)),0))","v":""},{"$f":"IF($B40=\"\",\"\",IFERROR(INDEX(Ingredients_DB!$W$2:$W$501, MATCH($B40, Ingredients_DB!$B$2:$B$501,0)),0))","v":""},{"$f":"IF($B40=\"\",\"\",IFERROR(INDEX(Ingredients_DB!$X$2:$X$501, MATCH($B40, Ingredients_DB!$B$2:$B$501,0)),0))","v":""},{"$f":"IF($B40=\"\",\"\",IFERROR(INDEX(Ingredients_DB!$Y$2:$Y$501, MATCH($B40, Ingredients_DB!$B$2:$B$501,0)),0))","v":""},{"$f":"IF($B40=\"\",\"\",IFERROR(INDEX(Ingredients_DB!$Z$2:$Z$501, MATCH($B40, Ingredients_DB!$B$2:$B$501,0)),0))","v":""}]
[21,null,{"v":0,"d":"0.00"},"g",null,"",{"$f":"IF($B41=\"\",\"\",IFERROR(INDEX(Ingredients_DB!$K$2:$K$501, MATCH($B41, Ingredients_DB!$B$2:$B$501,0)),0))","v":""},"",{"$nulls":6},{"$f":"IF($B41=\"\",\"\",IFERROR(INDEX(Ingredients_DB!$H$2:$H$501, MATCH($B41, Ingredients_DB!$B$2:$B$501,0)),\"\"))","v":""},{"$f":"IF($B41=\"\",\"\",IFERROR(INDEX(Ingredients_DB!$I$2:$I$501, MATCH($B41, Ingredients_DB!$B$2:$B$501,0)),\"\"))","v":""},{"$f":"IF($B41=\"\",\"\",IFERROR(VLOOKUP($O41&\"|\"&$D41,UOM_Conversions!$A$2:$E$50,4,FALSE),\"CHECK UNIT\"))","v":""},{"$f":"IF($B41=\"\",\"\",IFERROR(INDEX(Ingredients_DB!$M$2:$M$501, MATCH($B41, Ingredients_DB!$B$2:$B$501,0)),0))","v":""},{"$f":"IF($B41=\"\",\"\",IFERROR(INDEX(Ingredients_DB!$N$2:$N$501, MATCH($B41, Ingredients_DB!$B$2:$B$501,0)),0))","v":""},{"$f":"IF($B41=\"\",\"\",IFERROR(INDEX(Ingredients_DB!$O$2:$O$501, MATCH($B41, Ingredients_DB!$B$2:$B$501,0)),0))","v":""},{"$f":"IF($B41=\"\",\"\",IFERROR(INDEX(Ingredients_DB!$P$2:$P$501, MATCH($B41, Ingredients_DB!$B$2:$B$501,0)),0))","v":""},{"$f":"IF($B41=\"\",\"\",IFERROR(INDEX(Ingredients_DB!$Q$2:$Q$501, MATCH($B41, Ingredients_DB!$B$2:$B$501,0)),0))","v":""},{"$f":"IF($B41=\"\",\"\",IFERROR(INDEX(Ingredients_DB!$R$2:$R$501, MATCH($B41, Ingredients_DB!$B$2:$B$501,0)),0))","v":""},{"$f":"IF($B41=\"\",\"\",IFERROR(INDEX(Ingredients_DB!$S$2:$S$501, MATCH($B41, Ingredients_DB!$B$2:$B$501,0)),0))","v":""},{"$f":"IF($B41=\"\",\"\",IFERROR(INDEX(Ingredients_DB!$T$2:$T$501, MATCH($B41, Ingredients_DB!$B$2:$B$501,0)),0))","v":""},{"$f":"IF($B41=\"\",\"\",IFERROR(INDEX(Ingredients_DB!$U$2:$U$501, MATCH($B41, Ingredients_DB!$B$2:$B$501,0)),0))","v":""},{"$f":"IF($B41=\"\",\"\",IFERROR(INDEX(Ingredients_DB!$V$2:$V$501, MATCH($B41, Ingredients_DB!$B$2:$B$501,0)),0))","v":""},{"$f":"IF($B41=\"\",\"\",IFERROR(INDEX(Ingredients_DB!$W$2:$W$501, MATCH($B41, Ingredients_DB!$B$2:$B$501,0)),0))","v":""},{"$f":"IF($B41=\"\",\"\",IFERROR(INDEX(Ingredients_DB!$X$2:$X$501, MATCH($B41, Ingredients_DB!$B$2:$B$501,0)),0))","v":""},{"$f":"IF($B41=\"\",\"\",IFERROR(INDEX(Ingredients_DB!$Y$2:$Y$501, MATCH($B41, Ingredients_DB!$B$2:$B$501,0)),0))","v":""},{"$f":"IF($B41=\"\",\"\",IFERROR(INDEX(Ingredients_DB!$Z$2:$Z$501, MATCH($B41, Ingredients_DB!$B$2:$B$501,0)),0))","v":""}]
[22,null,{"v":0,"d":"0.00"},"g",null,"",{"$f":"IF($B42=\"\",\"\",IFERROR(INDEX(Ingredients_DB!$K$2:$K$501, MATCH($B42, Ingredients_DB!$B$2:$B$501,0)),0))","v":""},"",{"$nulls":6},{"$f":"IF($B42=\"\",\"\",IFERROR(INDEX(Ingredients_DB!$H$2:$H$501, MATCH($B42, Ingredients_DB!$B$2:$B$501,0)),\"\"))","v":""},{"$f":"IF($B42=\"\",\"\",IFERROR(INDEX(Ingredients_DB!$I$2:$I$501, MATCH($B42, Ingredients_DB!$B$2:$B$501,0)),\"\"))","v":""},{"$f":"IF($B42=\"\",\"\",IFERROR(VLOOKUP($O42&\"|\"&$D42,UOM_Conversions!$A$2:$E$50,4,FALSE),\"CHECK UNIT\"))","v":""},{"$f":"IF($B42=\"\",\"\",IFERROR(INDEX(Ingredients_DB!$M$2:$M$501, MATCH($B42, Ingredients_DB!$B$2:$B$501,0)),0))","v":""},{"$f":"IF($B42=\"\",\"\",IFERROR(INDEX(Ingredients_DB!$N$2:$N$501, MATCH($B42, Ingredients_DB!$B$2:$B$501,0)),0))","v":""},{"$f":"IF($B42=\"\",\"\",IFERROR(INDEX(Ingredients_DB!$O$2:$O$501, MATCH($B42, Ingredients_DB!$B$2:$B$501,0)),0))","v":""},{"$f":"IF($B42=\"\",\"\",IFERROR(INDEX(Ingredients_DB!$P$2:$P$501, MATCH($B42, Ingredients_DB!$B$2:$B$501,0)),0))","v":""},{"$f":"IF($B42=\"\",\"\",IFERROR(INDEX(Ingredients_DB!$Q$2:$Q$501, MATCH($B42, Ingredients_DB!$B$2:$B$501,0)),0))","v":""},{"$f":"IF($B42=\"\",\"\",IFERROR(INDEX(Ingredients_DB!$R$2:$R$501, MATCH($B42, Ingredients_DB!$B$2:$B$501,0)),0))","v":""},{"$f":"IF($B42=\"\",\"\",IFERROR(INDEX(Ingredients_DB!$S$2:$S$501, MATCH($B42, Ingredients_DB!$B$2:$B$501,0)),0))","v":""},{"$f":"IF($B42=\"\",\"\",IFERROR(INDEX(Ingredients_DB!$T$2:$T$501, MATCH($B42, Ingredients_DB!$B$2:$B$501,0)),0))","v":""},{"$f":"IF($B42=\"\",\"\",IFERROR(INDEX(Ingredients_DB!$U$2:$U$501, MATCH($B42, Ingredients_DB!$B$2:$B$501,0)),0))","v":""},{"$f":"IF($B42=\"\",\"\",IFERROR(INDEX(Ingredients_DB!$V$2:$V$501, MATCH($B42, Ingredients_DB!$B$2:$B$501,0)),0))","v":""},{"$f":"IF($B42=\"\",\"\",IFERROR(INDEX(Ingredients_DB!$W$2:$W$501, MATCH($B42, Ingredients_DB!$B$2:$B$501,0)),0))","v":""},{"$f":"IF($B42=\"\",\"\",IFERROR(INDEX(Ingredients_DB!$X$2:$X$501, MATCH($B42, Ingredients_DB!$B$2:$B$501,0)),0))","v":""},{"$f":"IF($B42=\"\",\"\",IFERROR(INDEX(Ingredients_DB!$Y$2:$Y$501, MATCH($B42, Ingredients_DB!$B$2:$B$501,0)),0))","v":""},{"$f":"IF($B42=\"\",\"\",IFERROR(INDEX(Ingredients_DB!$Z$2:$Z$501, MATCH($B42, Ingredients_DB!$B$2:$B$501,0)),0))","v":""}]
[23,null,{"v":0,"d":"0.00"},"g",null,"",{"$f":"IF($B43=\"\",\"\",IFERROR(INDEX(Ingredients_DB!$K$2:$K$501, MATCH($B43, Ingredients_DB!$B$2:$B$501,0)),0))","v":""},"",{"$nulls":6},{"$f":"IF($B43=\"\",\"\",IFERROR(INDEX(Ingredients_DB!$H$2:$H$501, MATCH($B43, Ingredients_DB!$B$2:$B$501,0)),\"\"))","v":""},{"$f":"IF($B43=\"\",\"\",IFERROR(INDEX(Ingredients_DB!$I$2:$I$501, MATCH($B43, Ingredients_DB!$B$2:$B$501,0)),\"\"))","v":""},{"$f":"IF($B43=\"\",\"\",IFERROR(VLOOKUP($O43&\"|\"&$D43,UOM_Conversions!$A$2:$E$50,4,FALSE),\"CHECK UNIT\"))","v":""},{"$f":"IF($B43=\"\",\"\",IFERROR(INDEX(Ingredients_DB!$M$2:$M$501, MATCH($B43, Ingredients_DB!$B$2:$B$501,0)),0))","v":""},{"$f":"IF($B43=\"\",\"\",IFERROR(INDEX(Ingredients_DB!$N$2:$N$501, MATCH($B43, Ingredients_DB!$B$2:$B$501,0)),0))","v":""},{"$f":"IF($B43=\"\",\"\",IFERROR(INDEX(Ingredients_DB!$O$2:$O$501, MATCH($B43, Ingredients_DB!$B$2:$B$501,0)),0))","v":""},{"$f":"IF($B43=\"\",\"\",IFERROR(INDEX(Ingredients_DB!$P$2:$P$501, MATCH($B43, Ingredients_DB!$B$2:$B$501,0)),0))","v":""},{"$f":"IF($B43=\"\",\"\",IFERROR(INDEX(Ingredients_DB!$Q$2:$Q$501, MATCH($B43, Ingredients_DB!$B$2:$B$501,0)),0))","v":""},{"$f":"IF($B43=\"\",\"\",IFERROR(INDEX(Ingredients_DB!$R$2:$R$501, MATCH($B43, Ingredients_DB!$B$2:$B$501,0)),0))","v":""},{"$f":"IF($B43=\"\",\"\",IFERROR(INDEX(Ingredients_DB!$S$2:$S$501, MATCH($B43, Ingredients_DB!$B$2:$B$501,0)),0))","v":""},{"$f":"IF($B43=\"\",\"\",IFERROR(INDEX(Ingredients_DB!$T$2:$T$501, MATCH($B43, Ingredients_DB!$B$2:$B$501,0)),0))","v":""},{"$f":"IF($B43=\"\",\"\",IFERROR(INDEX(Ingredients_DB!$U$2:$U$501, MATCH($B43, Ingredients_DB!$B$2:$B$501,0)),0))","v":""},{"$f":"IF($B43=\"\",\"\",IFERROR(INDEX(Ingredients_DB!$V$2:$V$501, MATCH($B43, Ingredients_DB!$B$2:$B$501,0)),0))","v":""},{"$f":"IF($B43=\"\",\"\",IFERROR(INDEX(Ingredients_DB!$W$2:$W$501, MATCH($B43, Ingredients_DB!$B$2:$B$501,0)),0))","v":""},{"$f":"IF($B43=\"\",\"\",IFERROR(INDEX(Ingredients_DB!$X$2:$X$501, MATCH($B43, Ingredients_DB!$B$2:$B$501,0)),0))","v":""},{"$f":"IF($B43=\"\",\"\",IFERROR(INDEX(Ingredients_DB!$Y$2:$Y$501, MATCH($B43, Ingredients_DB!$B$2:$B$501,0)),0))","v":""},{"$f":"IF($B43=\"\",\"\",IFERROR(INDEX(Ingredients_DB!$Z$2:$Z$501, MATCH($B43, Ingredients_DB!$B$2:$B$501,0)),0))","v":""}]
[24,null,{"v":0,"d":"0.00"},"g",null,"",{"$f":"IF($B44=\"\",\"\",IFERROR(INDEX(Ingredients_DB!$K$2:$K$501, MATCH($B44, Ingredients_DB!$B$2:$B$501,0)),0))","v":""},"",{"$nulls":6},{"$f":"IF($B44=\"\",\"\",IFERROR(INDEX(Ingredients_DB!$H$2:$H$501, MATCH($B44, Ingredients_DB!$B$2:$B$501,0)),\"\"))","v":""},{"$f":"IF($B44=\"\",\"\",IFERROR(INDEX(Ingredients_DB!$I$2:$I$501, MATCH($B44, Ingredients_DB!$B$2:$B$501,0)),\"\"))","v":""},{"$f":"IF($B44=\"\",\"\",IFERROR(VLOOKUP($O44&\"|\"&$D44,UOM_Conversions!$A$2:$E$50,4,FALSE),\"CHECK UNIT\"))","v":""},{"$f":"IF($B44=\"\",\"\",IFERROR(INDEX(Ingredients_DB!$M$2:$M$501, MATCH($B44, Ingredients_DB!$B$2:$B$501,0)),0))","v":""},{"$f":"IF($B44=\"\",\"\",IFERROR(INDEX(Ingredients_DB!$N$2:$N$501, MATCH($B44, Ingredients_DB!$B$2:$B$501,0)),0))","v":""},{"$f":"IF($B44=\"\",\"\",IFERROR(INDEX(Ingredients_DB!$O$2:$O$501, MATCH($B44, Ingredients_DB!$B$2:$B$501,0)),0))","v":""},{"$f":"IF($B44=\"\",\"\",IFERROR(INDEX(Ingredients_DB!$P$2:$P$501, MATCH($B44, Ingredients_DB!$B$2:$B$501,0)),0))","v":""},{"$f":"IF($B44=\"\",\"\",IFERROR(INDEX(Ingredients_DB!$Q$2:$Q$501, MATCH($B44, Ingredients_DB!$B$2:$B$501,0)),0))","v":""},{"$f":"IF($B44=\"\",\"\",IFERROR(INDEX(Ingredients_DB!$R$2:$R$501, MATCH($B44, Ingredients_DB!$B$2:$B$501,0)),0))","v":""},{"$f":"IF($B44=\"\",\"\",IFERROR(INDEX(Ingredients_DB!$S$2:$S$501, MATCH($B44, Ingredients_DB!$B$2:$B$501,0)),0))","v":""},{"$f":"IF($B44=\"\",\"\",IFERROR(INDEX(Ingredients_DB!$T$2:$T$501, MATCH($B44, Ingredients_DB!$B$2:$B$501,0)),0))","v":""},{"$f":"IF($B44=\"\",\"\",IFERROR(INDEX(Ingredients_DB!$U$2:$U$501, MATCH($B44, Ingredients_DB!$B$2:$B$501,0)),0))","v":""},{"$f":"IF($B44=\"\",\"\",IFERROR(INDEX(Ingredients_DB!$V$2:$V$501, MATCH($B44, Ingredients_DB!$B$2:$B$501,0)),0))","v":""},{"$f":"IF($B44=\"\",\"\",IFERROR(INDEX(Ingredients_DB!$W$2:$W$501, MATCH($B44, Ingredients_DB!$B$2:$B$501,0)),0))","v":""},{"$f":"IF($B44=\"\",\"\",IFERROR(INDEX(Ingredients_DB!$X$2:$X$501, MATCH($B44, Ingredients_DB!$B$2:$B$501,0)),0))","v":""},{"$f":"IF($B44=\"\",\"\",IFERROR(INDEX(Ingredients_DB!$Y$2:$Y$501, MATCH($B44, Ingredients_DB!$B$2:$B$501,0)),0))","v":""},{"$f":"IF($B44=\"\",\"\",IFERROR(INDEX(Ingredients_DB!$Z$2:$Z$501, MATCH($B44, Ingredients_DB!$B$2:$B$501,0)),0))","v":""}]
[25,null,{"v":0,"d":"0.00"},"g",null,"",{"$f":"IF($B45=\"\",\"\",IFERROR(INDEX(Ingredients_DB!$K$2:$K$501, MATCH($B45, Ingredients_DB!$B$2:$B$501,0)),0))","v":""},"",{"$nulls":6},{"$f":"IF($B45=\"\",\"\",IFERROR(INDEX(Ingredients_DB!$H$2:$H$501, MATCH($B45, Ingredients_DB!$B$2:$B$501,0)),\"\"))","v":""},{"$f":"IF($B45=\"\",\"\",IFERROR(INDEX(Ingredients_DB!$I$2:$I$501, MATCH($B45, Ingredients_DB!$B$2:$B$501,0)),\"\"))","v":""},{"$f":"IF($B45=\"\",\"\",IFERROR(VLOOKUP($O45&\"|\"&$D45,UOM_Conversions!$A$2:$E$50,4,FALSE),\"CHECK UNIT\"))","v":""},{"$f":"IF($B45=\"\",\"\",IFERROR(INDEX(Ingredients_DB!$M$2:$M$501, MATCH($B45, Ingredients_DB!$B$2:$B$501,0)),0))","v":""},{"$f":"IF($B45=\"\",\"\",IFERROR(INDEX(Ingredients_DB!$N$2:$N$501, MATCH($B45, Ingredients_DB!$B$2:$B$501,0)),0))","v":""},{"$f":"IF($B45=\"\",\"\",IFERROR(INDEX(Ingredients_DB!$O$2:$O$501, MATCH($B45, Ingredients_DB!$B$2:$B$501,0)),0))","v":""},{"$f":"IF($B45=\"\",\"\",IFERROR(INDEX(Ingredients_DB!$P$2:$P$501, MATCH($B45, Ingredients_DB!$B$2:$B$501,0)),0))","v":""},{"$f":"IF($B45=\"\",\"\",IFERROR(INDEX(Ingredients_DB!$Q$2:$Q$501, MATCH($B45, Ingredients_DB!$B$2:$B$501,0)),0))","v":""},{"$f":"IF($B45=\"\",\"\",IFERROR(INDEX(Ingredients_DB!$R$2:$R$501, MATCH($B45, Ingredients_DB!$B$2:$B$501,0)),0))","v":""},{"$f":"IF($B45=\"\",\"\",IFERROR(INDEX(Ingredients_DB!$S$2:$S$501, MATCH($B45, Ingredients_DB!$B$2:$B$501,0)),0))","v":""},{"$f":"IF($B45=\"\",\"\",IFERROR(INDEX(Ingredients_DB!$T$2:$T$501, MATCH($B45, Ingredients_DB!$B$2:$B$501,0)),0))","v":""},{"$f":"IF($B45=\"\",\"\",IFERROR(INDEX(Ingredients_DB!$U$2:$U$501, MATCH($B45, Ingredients_DB!$B$2:$B$501,0)),0))","v":""},{"$f":"IF($B45=\"\",\"\",IFERROR(INDEX(Ingredients_DB!$V$2:$V$501, MATCH($B45, Ingredients_DB!$B$2:$B$501,0)),0))","v":""},{"$f":"IF($B45=\"\",\"\",IFERROR(INDEX(Ingredients_DB!$W$2:$W$501, MATCH($B45, Ingredients_DB!$B$2:$B$501,0)),0))","v":""},{"$f":"IF($B45=\"\",\"\",IFERROR(INDEX(Ingredients_DB!$X$2:$X$501, MATCH($B45, Ingredients_DB!$B$2:$B$501,0)),0))","v":""},{"$f":"IF($B45=\"\",\"\",IFERROR(INDEX(Ingredients_DB!$Y$2:$Y$501, MATCH($B45, Ingredients_DB!$B$2:$B$501,0)),0))","v":""},{"$f":"IF($B45=\"\",\"\",IFERROR(INDEX(Ingredients_DB!$Z$2:$Z$501, MATCH($B45, Ingredients_DB!$B$2:$B$501,0)),0))","v":""}]
[26,null,{"v":0,"d":"0.00"},"g",null,"",{"$f":"IF($B46=\"\",\"\",IFERROR(INDEX(Ingredients_DB!$K$2:$K$501, MATCH($B46, Ingredients_DB!$B$2:$B$501,0)),0))","v":""},"",{"$nulls":6},{"$f":"IF($B46=\"\",\"\",IFERROR(INDEX(Ingredients_DB!$H$2:$H$501, MATCH($B46, Ingredients_DB!$B$2:$B$501,0)),\"\"))","v":""},{"$f":"IF($B46=\"\",\"\",IFERROR(INDEX(Ingredients_DB!$I$2:$I$501, MATCH($B46, Ingredients_DB!$B$2:$B$501,0)),\"\"))","v":""},{"$f":"IF($B46=\"\",\"\",IFERROR(VLOOKUP($O46&\"|\"&$D46,UOM_Conversions!$A$2:$E$50,4,FALSE),\"CHECK UNIT\"))","v":""},{"$f":"IF($B46=\"\",\"\",IFERROR(INDEX(Ingredients_DB!$M$2:$M$501, MATCH($B46, Ingredients_DB!$B$2:$B$501,0)),0))","v":""},{"$f":"IF($B46=\"\",\"\",IFERROR(INDEX(Ingredients_DB!$N$2:$N$501, MATCH($B46, Ingredients_DB!$B$2:$B$501,0)),0))","v":""},{"$f":"IF($B46=\"\",\"\",IFERROR(INDEX(Ingredients_DB!$O$2:$O$501, MATCH($B46, Ingredients_DB!$B$2:$B$501,0)),0))","v":""},{"$f":"IF($B46=\"\",\"\",IFERROR(INDEX(Ingredients_DB!$P$2:$P$501, MATCH($B46, Ingredients_DB!$B$2:$B$501,0)),0))","v":""},{"$f":"IF($B46=\"\",\"\",IFERROR(INDEX(Ingredients_DB!$Q$2:$Q$501, MATCH($B46, Ingredients_DB!$B$2:$B$501,0)),0))","v":""},{"$f":"IF($B46=\"\",\"\",IFERROR(INDEX(Ingredients_DB!$R$2:$R$501, MATCH($B46, Ingredients_DB!$B$2:$B$501,0)),0))","v":""},{"$f":"IF($B46=\"\",\"\",IFERROR(INDEX(Ingredients_DB!$S$2:$S$501, MATCH($B46, Ingredients_DB!$B$2:$B$501,0)),0))","v":""},{"$f":"IF($B46=\"\",\"\",IFERROR(INDEX(Ingredients_DB!$T$2:$T$501, MATCH($B46, Ingredients_DB!$B$2:$B$501,0)),0))","v":""},{"$f":"IF($B46=\"\",\"\",IFERROR(INDEX(Ingredients_DB!$U$2:$U$501, MATCH($B46, Ingredients_DB!$B$2:$B$501,0)),0))","v":""},{"$f":"IF($B46=\"\",\"\",IFERROR(INDEX(Ingredients_DB!$V$2:$V$501, MATCH($B46, Ingredients_DB!$B$2:$B$501,0)),0))","v":""},{"$f":"IF($B46=\"\",\"\",IFERROR(INDEX(Ingredients_DB!$W$2:$W$501, MATCH($B46, Ingredients_DB!$B$2:$B$501,0)),0))","v":""},{"$f":"IF($B46=\"\",\"\",IFERROR(INDEX(Ingredients_DB!$X$2:$X$501, MATCH($B46, Ingredients_DB!$B$2:$B$501,0)),0))","v":""},{"$f":"IF($B46=\"\",\"\",IFERROR(INDEX(Ingredients_DB!$Y$2:$Y$501, MATCH($B46, Ingredients_DB!$B$2:$B$501,0)),0))","v":""},{"$f":"IF($B46=\"\",\"\",IFERROR(INDEX(Ingredients_DB!$Z$2:$Z$501, MATCH($B46, Ingredients_DB!$B$2:$B$501,0)),0))","v":""}]
[27,null,{"v":0,"d":"0.00"},"g",null,"",{"$f":"IF($B47=\"\",\"\",IFERROR(INDEX(Ingredients_DB!$K$2:$K$501, MATCH($B47, Ingredients_DB!$B$2:$B$501,0)),0))","v":""},"",{"$nulls":6},{"$f":"IF($B47=\"\",\"\",IFERROR(INDEX(Ingredients_DB!$H$2:$H$501, MATCH($B47, Ingredients_DB!$B$2:$B$501,0)),\"\"))","v":""},{"$f":"IF($B47=\"\",\"\",IFERROR(INDEX(Ingredients_DB!$I$2:$I$501, MATCH($B47, Ingredients_DB!$B$2:$B$501,0)),\"\"))","v":""},{"$f":"IF($B47=\"\",\"\",IFERROR(VLOOKUP($O47&\"|\"&$D47,UOM_Conversions!$A$2:$E$50,4,FALSE),\"CHECK UNIT\"))","v":""},{"$f":"IF($B47=\"\",\"\",IFERROR(INDEX(Ingredients_DB!$M$2:$M$501, MATCH($B47, Ingredients_DB!$B$2:$B$501,0)),0))","v":""},{"$f":"IF($B47=\"\",\"\",IFERROR(INDEX(Ingredients_DB!$N$2:$N$501, MATCH($B47, Ingredients_DB!$B$2:$B$501,0)),0))","v":""},{"$f":"IF($B47=\"\",\"\",IFERROR(INDEX(Ingredients_DB!$O$2:$O$501, MATCH($B47, Ingredients_DB!$B$2:$B$501,0)),0))","v":""},{"$f":"IF($B47=\"\",\"\",IFERROR(INDEX(Ingredients_DB!$P$2:$P$501, MATCH($B47, Ingredients_DB!$B$2:$B$501,0)),0))","v":""},{"$f":"IF($B47=\"\",\"\",IFERROR(INDEX(Ingredients_DB!$Q$2:$Q$501, MATCH($B47, Ingredients_DB!$B$2:$B$501,0)),0))","v":""},{"$f":"IF($B47=\"\",\"\",IFERROR(INDEX(Ingredients_DB!$R$2:$R$501, MATCH($B47, Ingredients_DB!$B$2:$B$501,0)),0))","v":""},{"$f":"IF($B47=\"\",\"\",IFERROR(INDEX(Ingredients_DB!$S$2:$S$501, MATCH($B47, Ingredients_DB!$B$2:$B$501,0)),0))","v":""},{"$f":"IF($B47=\"\",\"\",IFERROR(INDEX(Ingredients_DB!$T$2:$T$501, MATCH($B47, Ingredients_DB!$B$2:$B$501,0)),0))","v":""},{"$f":"IF($B47=\"\",\"\",IFERROR(INDEX(Ingredients_DB!$U$2:$U$501, MATCH($B47, Ingredients_DB!$B$2:$B$501,0)),0))","v":""},{"$f":"IF($B47=\"\",\"\",IFERROR(INDEX(Ingredients_DB!$V$2:$V$501, MATCH($B47, Ingredients_DB!$B$2:$B$501,0)),0))","v":""},{"$f":"IF($B47=\"\",\"\",IFERROR(INDEX(Ingredients_DB!$W$2:$W$501, MATCH($B47, Ingredients_DB!$B$2:$B$501,0)),0))","v":""},{"$f":"IF($B47=\"\",\"\",IFERROR(INDEX(Ingredients_DB!$X$2:$X$501, MATCH($B47, Ingredients_DB!$B$2:$B$501,0)),0))","v":""},{"$f":"IF($B47=\"\",\"\",IFERROR(INDEX(Ingredients_DB!$Y$2:$Y$501, MATCH($B47, Ingredients_DB!$B$2:$B$501,0)),0))","v":""},{"$f":"IF($B47=\"\",\"\",IFERROR(INDEX(Ingredients_DB!$Z$2:$Z$501, MATCH($B47, Ingredients_DB!$B$2:$B$501,0)),0))","v":""}]
[28,null,{"v":0,"d":"0.00"},"g",null,"",{"$f":"IF($B48=\"\",\"\",IFERROR(INDEX(Ingredients_DB!$K$2:$K$501, MATCH($B48, Ingredients_DB!$B$2:$B$501,0)),0))","v":""},"",{"$nulls":6},{"$f":"IF($B48=\"\",\"\",IFERROR(INDEX(Ingredients_DB!$H$2:$H$501, MATCH($B48, Ingredients_DB!$B$2:$B$501,0)),\"\"))","v":""},{"$f":"IF($B48=\"\",\"\",IFERROR(INDEX(Ingredients_DB!$I$2:$I$501, MATCH($B48, Ingredients_DB!$B$2:$B$501,0)),\"\"))","v":""},{"$f":"IF($B48=\"\",\"\",IFERROR(VLOOKUP($O48&\"|\"&$D48,UOM_Conversions!$A$2:$E$50,4,FALSE),\"CHECK UNIT\"))","v":""},{"$f":"IF($B48=\"\",\"\",IFERROR(INDEX(Ingredients_DB!$M$2:$M$501, MATCH($B48, Ingredients_DB!$B$2:$B$501,0)),0))","v":""},{"$f":"IF($B48=\"\",\"\",IFERROR(INDEX(Ingredients_DB!$N$2:$N$501, MATCH($B48, Ingredients_DB!$B$2:$B$501,0)),0))","v":""},{"$f":"IF($B48=\"\",\"\",IFERROR(INDEX(Ingredients_DB!$O$2:$O$501, MATCH($B48, Ingredients_DB!$B$2:$B$501,0)),0))","v":""},{"$f":"IF($B48=\"\",\"\",IFERROR(INDEX(Ingredients_DB!$P$2:$P$501, MATCH($B48, Ingredients_DB!$B$2:$B$501,0)),0))","v":""},{"$f":"IF($B48=\"\",\"\",IFERROR(INDEX(Ingredients_DB!$Q$2:$Q$501, MATCH($B48, Ingredients_DB!$B$2:$B$501,0)),0))","v":""},{"$f":"IF($B48=\"\",\"\",IFERROR(INDEX(Ingredients_DB!$R$2:$R$501, MATCH($B48, Ingredients_DB!$B$2:$B$501,0)),0))","v":""},{"$f":"IF($B48=\"\",\"\",IFERROR(INDEX(Ingredients_DB!$S$2:$S$501, MATCH($B48, Ingredients_DB!$B$2:$B$501,0)),0))","v":""},{"$f":"IF($B48=\"\",\"\",IFERROR(INDEX(Ingredients_DB!$T$2:$T$501, MATCH($B48, Ingredients_DB!$B$2:$B$501,0)),0))","v":""},{"$f":"IF($B48=\"\",\"\",IFERROR(INDEX(Ingredients_DB!$U$2:$U$501, MATCH($B48, Ingredients_DB!$B$2:$B$501,0)),0))","v":""},{"$f":"IF($B48=\"\",\"\",IFERROR(INDEX(Ingredients_DB!$V$2:$V$501, MATCH($B48, Ingredients_DB!$B$2:$B$501,0)),0))","v":""},{"$f":"IF($B48=\"\",\"\",IFERROR(INDEX(Ingredients_DB!$W$2:$W$501, MATCH($B48, Ingredients_DB!$B$2:$B$501,0)),0))","v":""},{"$f":"IF($B48=\"\",\"\",IFERROR(INDEX(Ingredients_DB!$X$2:$X$501, MATCH($B48, Ingredients_DB!$B$2:$B$501,0)),0))","v":""},{"$f":"IF($B48=\"\",\"\",IFERROR(INDEX(Ingredients_DB!$Y$2:$Y$501, MATCH($B48, Ingredients_DB!$B$2:$B$501,0)),0))","v":""},{"$f":"IF($B48=\"\",\"\",IFERROR(INDEX(Ingredients_DB!$Z$2:$Z$501, MATCH($B48, Ingredients_DB!$B$2:$B$501,0)),0))","v":""}]
[29,null,{"v":0,"d":"0.00"},"g",null,"",{"$f":"IF($B49=\"\",\"\",IFERROR(INDEX(Ingredients_DB!$K$2:$K$501, MATCH($B49, Ingredients_DB!$B$2:$B$501,0)),0))","v":""},"",{"$nulls":6},{"$f":"IF($B49=\"\",\"\",IFERROR(INDEX(Ingredients_DB!$H$2:$H$501, MATCH($B49, Ingredients_DB!$B$2:$B$501,0)),\"\"))","v":""},{"$f":"IF($B49=\"\",\"\",IFERROR(INDEX(Ingredients_DB!$I$2:$I$501, MATCH($B49, Ingredients_DB!$B$2:$B$501,0)),\"\"))","v":""},{"$f":"IF($B49=\"\",\"\",IFERROR(VLOOKUP($O49&\"|\"&$D49,UOM_Conversions!$A$2:$E$50,4,FALSE),\"CHECK UNIT\"))","v":""},{"$f":"IF($B49=\"\",\"\",IFERROR(INDEX(Ingredients_DB!$M$2:$M$501, MATCH($B49, Ingredients_DB!$B$2:$B$501,0)),0))","v":""},{"$f":"IF($B49=\"\",\"\",IFERROR(INDEX(Ingredients_DB!$N$2:$N$501, MATCH($B49, Ingredients_DB!$B$2:$B$501,0)),0))","v":""},{"$f":"IF($B49=\"\",\"\",IFERROR(INDEX(Ingredients_DB!$O$2:$O$501, MATCH($B49, Ingredients_DB!$B$2:$B$501,0)),0))","v":""},{"$f":"IF($B49=\"\",\"\",IFERROR(INDEX(Ingredients_DB!$P$2:$P$501, MATCH($B49, Ingredients_DB!$B$2:$B$501,0)),0))","v":""},{"$f":"IF($B49=\"\",\"\",IFERROR(INDEX(Ingredients_DB!$Q$2:$Q$501, MATCH($B49, Ingredients_DB!$B$2:$B$501,0)),0))","v":""},{"$f":"IF($B49=\"\",\"\",IFERROR(INDEX(Ingredients_DB!$R$2:$R$501, MATCH($B49, Ingredients_DB!$B$2:$B$501,0)),0))","v":""},{"$f":"IF($B49=\"\",\"\",IFERROR(INDEX(Ingredients_DB!$S$2:$S$501, MATCH($B49, Ingredients_DB!$B$2:$B$501,0)),0))","v":""},{"$f":"IF($B49=\"\",\"\",IFERROR(INDEX(Ingredients_DB!$T$2:$T$501, MATCH($B49, Ingredients_DB!$B$2:$B$501,0)),0))","v":""},{"$f":"IF($B49=\"\",\"\",IFERROR(INDEX(Ingredients_DB!$U$2:$U$501, MATCH($B49, Ingredients_DB!$B$2:$B$501,0)),0))","v":""},{"$f":"IF($B49=\"\",\"\",IFERROR(INDEX(Ingredients_DB!$V$2:$V$501, MATCH($B49, Ingredients_DB!$B$2:$B$501,0)),0))","v":""},{"$f":"IF($B49=\"\",\"\",IFERROR(INDEX(Ingredients_DB!$W$2:$W$501, MATCH($B49, Ingredients_DB!$B$2:$B$501,0)),0))","v":""},{"$f":"IF($B49=\"\",\"\",IFERROR(INDEX(Ingredients_DB!$X$2:$X$501, MATCH($B49, Ingredients_DB!$B$2:$B$501,0)),0))","v":""},{"$f":"IF($B49=\"\",\"\",IFERROR(INDEX(Ingredients_DB!$Y$2:$Y$501, MATCH($B49, Ingredients_DB!$B$2:$B$501,0)),0))","v":""},{"$f":"IF($B49=\"\",\"\",IFERROR(INDEX(Ingredients_DB!$Z$2:$Z$501, MATCH($B49, Ingredients_DB!$B$2:$B$501,0)),0))","v":""}]
[30,null,{"v":0,"d":"0.00"},"g",null,"",{"$f":"IF($B50=\"\",\"\",IFERROR(INDEX(Ingredients_DB!$K$2:$K$501, MATCH($B50, Ingredients_DB!$B$2:$B$501,0)),0))","v":""},"",{"$nulls":6},{"$f":"IF($B50=\"\",\"\",IFERROR(INDEX(Ingredients_DB!$H$2:$H$501, MATCH($B50, Ingredients_DB!$B$2:$B$501,0)),\"\"))","v":""},{"$f":"IF($B50=\"\",\"\",IFERROR(INDEX(Ingredients_DB!$I$2:$I$501, MATCH($B50, Ingredients_DB!$B$2:$B$501,0)),\"\"))","v":""},{"$f":"IF($B50=\"\",\"\",IFERROR(VLOOKUP($O50&\"|\"&$D50,UOM_Conversions!$A$2:$E$50,4,FALSE),\"CHECK UNIT\"))","v":""},{"$f":"IF($B50=\"\",\"\",IFERROR(INDEX(Ingredients_DB!$M$2:$M$501, MATCH($B50, Ingredients_DB!$B$2:$B$501,0)),0))","v":""},{"$f":"IF($B50=\"\",\"\",IFERROR(INDEX(Ingredients_DB!$N$2:$N$501, MATCH($B50, Ingredients_DB!$B$2:$B$501,0)),0))","v":""},{"$f":"IF($B50=\"\",\"\",IFERROR(INDEX(Ingredients_DB!$O$2:$O$501, MATCH($B50, Ingredients_DB!$B$2:$B$501,0)),0))","v":""},{"$f":"IF($B50=\"\",\"\",IFERROR(INDEX(Ingredients_DB!$P$2:$P$501, MATCH($B50, Ingredients_DB!$B$2:$B$501,0)),0))","v":""},{"$f":"IF($B50=\"\",\"\",IFERROR(INDEX(Ingredients_DB!$Q$2:$Q$501, MATCH($B50, Ingredients_DB!$B$2:$B$501,0)),0))","v":""},{"$f":"IF($B50=\"\",\"\",IFERROR(INDEX(Ingredients_DB!$R$2:$R$501, MATCH($B50, Ingredients_DB!$B$2:$B$501,0)),0))","v":""},{"$f":"IF($B50=\"\",\"\",IFERROR(INDEX(Ingredients_DB!$S$2:$S$501, MATCH($B50, Ingredients_DB!$B$2:$B$501,0)),0))","v":""},{"$f":"IF($B50=\"\",\"\",IFERROR(INDEX(Ingredients_DB!$T$2:$T$501, MATCH($B50, Ingredients_DB!$B$2:$B$501,0)),0))","v":""},{"$f":"IF($B50=\"\",\"\",IFERROR(INDEX(Ingredients_DB!$U$2:$U$501, MATCH($B50, Ingredients_DB!$B$2:$B$501,0)),0))","v":""},{"$f":"IF($B50=\"\",\"\",IFERROR(INDEX(Ingredients_DB!$V$2:$V$501, MATCH($B50, Ingredients_DB!$B$2:$B$501,0)),0))","v":""},{"$f":"IF($B50=\"\",\"\",IFERROR(INDEX(Ingredients_DB!$W$2:$W$501, MATCH($B50, Ingredients_DB!$B$2:$B$501,0)),0))","v":""},{"$f":"IF($B50=\"\",\"\",IFERROR(INDEX(Ingredients_DB!$X$2:$X$501, MATCH($B50, Ingredients_DB!$B$2:$B$501,0)),0))","v":""},{"$f":"IF($B50=\"\",\"\",IFERROR(INDEX(Ingredients_DB!$Y$2:$Y$501, MATCH($B50, Ingredients_DB!$B$2:$B$501,0)),0))","v":""},{"$f":"IF($B50=\"\",\"\",IFERROR(INDEX(Ingredients_DB!$Z$2:$Z$501, MATCH($B50, Ingredients_DB!$B$2:$B$501,0)),0))","v":""}]

{"sheet":"_NAV_STATE","index":8,"n_rows":6,"n_cols":2,"rows_kept":6,"hidden":true}
["Summary","Example 1"]
["F4","C8"]
["Example 1",1]
[4,1]
[2,100]
[115]